{"text_format":"1","workbook":"xlsx","n_sheets":19,"sheets":["wksRules","Introduction","Survey Fees","Order Form","Order Form (SP)","Order Form (SC)","Order Form (Ad-Hoc)","Order Form (Ad-Hoc CDO)","Country Selection","Subscription Agreement","Survey Access","Survey Contacts","HQ and Regional Contacts","QueryResult","BG Use Only","Invoices","SO Notification","RegDataBase","BG Use Only 2"],"not_rendered":{"charts":0,"images":3,"macros":1,"external_links":1,"defined_names":159,"comments":0,"pivot_tables":0},"unopened":[],"bounds":{"document_bytes":16777216,"sheet_cells":100000,"rows_first":2000,"rows_last":500,"rows_between":2000,"halvings":0,"cell_chars":16384,"cell_head_chars":4096},"cells_cut":0,"cells_raw":0,"read":"whole","date_system":"1900"}

{"sheet":"wksRules","index":0,"n_rows":220,"n_cols":11,"rows_kept":220,"cut":false,"hidden":true,"merged":[[20,5,20,8],[113,5,113,8],[135,5,135,8],[136,5,136,8],[45,5,45,8],[23,5,23,8],[134,5,134,8],[68,5,68,8],[95,5,95,8],[100,5,100,8],[73,5,73,8],[124,5,124,8],[89,5,89,8],[101,5,101,8],[119,5,119,8],[22,5,22,8],[156,5,156,8],[132,5,132,8],[138,5,138,8],[152,5,152,8],[146,5,146,8],[148,5,148,8],[149,5,149,8],[150,5,150,8],[19,5,19,8],[34,5,34,8],[215,5,215,8],[201,5,201,8],[172,5,172,8],[179,5,179,8],[185,5,185,8],[202,5,202,8],[199,5,199,8],[181,5,181,8],[157,5,157,8],[164,5,164,8],[171,5,171,8],[75,5,75,8],[163,5,163,8],[170,5,170,8],[219,5,219,8],[8,5,8,14],[112,5,112,8],[115,5,115,8],[71,5,71,8],[178,5,178,8],[184,5,184,8],[198,5,198,8],[182,5,182,8],[9,5,9,6],[13,5,13,8],[96,5,96,8],[123,5,123,8],[111,5,111,8],[70,5,70,8],[109,5,109,8]]}
[]
[null,null,"2011 Global Order Form Calculation Descriptions & Settings"]
[null,null,"Cells highlighted in yellow can be modified as needed"]
[]
[null,null,null,"Named Formula"]
[]
[null,"Order Forms"]
[]
[null,null,"Order Form Sheet Name",null,null,"Global Order Form Svys 1-2"]
[null,null,"Value used to indicate an order","ORDER",null,"x",null,null,null,null,"Case insensitive value required for an item on the order forms to be identified by the formulas."]
[]
[null,"Discounts"]
[]
[null,null,"Text displayed if product is free","CASH_PREV_FREE_TEXT",null," Complimentary"]
[]
[null,null,"TCM 3 Year Commitment"]
[]
[null,null,"Range Address","TCM_COMMIT_RNG",null,{"$f":"CONCATENATE(ADDRESS(ROW(TCM_COMMIT_RNG),COLUMN(TCM_COMMIT_RNG),,,$F$9),\":\",ADDRESS(ROW(TCM_COMMIT_RNG)+ROWS(TCM_COMMIT_RNG)-1,COLUMN(TCM_COMMIT_RNG)))","v":{"$error":"#NAME?"}}]
[]
[null,null,"Discount %","TCM_COMMIT_BASE_DISCOUNT",null,0.1]
[null,null,"Current Discount %","TCM_COMMIT_CURRENT_DISCOUNT",null,{"$f":"IF(TCM_COMMIT_ORDERS>=TCM_COMMIT_MARKETS,TCM_COMMIT_BASE_DISCOUNT,0)","v":{"$error":"#NAME?"}}]
[]
[null,null,"Market Threshold","TCM_COMMIT_MARKETS",null,10]
[null,null,"Total Current Commitments","TCM_COMMIT_ORDERS",null,{"$f":"COUNTIF(TCM_COMMIT_RNG,\"<>\")","v":{"$error":"#NAME?"}}]
[]
[null,null,"Discount Details"]
[null,null,"Eligibility Requirement",null,null,"Market Threshold must be met"]
[null,null,"Who gets the discount",null,null,"All TCM Markets"]
[null,null,"Product(s) discounted",null,null,"All TCM products except TCM Light & All TCM Caps (See TCM Cash Online and TCM Gen Ind Cash & Prev sections)"]
[null,null,"How the discount is applied",null,null,"Discount is added to the TCM + VCM Bundle discount and applied to the Fee (See \"Fee\" column)"]
[null,null,"How the discount is displayed",null,null,"N/A"]
[]
[null,null,"VCM 3 Year Commitment"]
[]
[null,null,"Discount %","VCM_COMMIT_BASE_DISCOUNT",null,0.1]
[]
[null,null,"Discount Details"]
[null,null,"Eligibility Requirement",null,null,"VCM 3 Year Commitment"]
[null,null,"Who gets the discount",null,null,"Market(s) meeting the eligibility requirements"]
[null,null,"Product(s) discounted",null,null,"VCM Survey"]
[null,null,"How the discount is applied",null,null,"VCM Survey price is reduced"]
[null,null,"How the discount is displayed",null,null,"N/A"]
[]
[null,null,"TCM + VCM Bundle"]
[]
[null,null,"Discount %","TCM_BUNDLE_BASE_DISCOUNT",null,0.05]
[]
[null,null,"Discount Details"]
[null,null,"Eligibility Requirements",null,null,"1) TCM 3 Year Commitment must be active (ie Market Threshold being met)"]
[null,null,null,null,null,"2) TCM 3 Year Commitment"]
[null,null,null,null,null,"3) VCM 3 Year Commitment"]
[null,null,"Who gets the discount",null,null,"Market(s) meeting the eligibility requirements"]
[null,null,"Product(s) discounted",null,null,"All TCM products except TCM Light"]
[null,null,"How the discount is applied",null,null,"Discount is added to the TCM 3 Year Commitment discount and applied to the Total Fee (See \"Total Fee\" column)"]
[null,null,"How the discount is displayed",null,null,"N/A"]
[]
[null,null,"TCM Gen Ind Cash & Prev"]
[null,null,"See TCM Gen Ind Cash & Prev section"]
[]
[null,null,"Salary Increase Survey (SIS)"]
[null,null,"See Salary Increase Survey (SIS) section"]
[]
[null,"TCM Gen Ind Cash & Prev"]
[]
[null,null,"Pay Orders"]
[]
[null,null,"Range Address","CASH_PREV_PAY_RNG",null,{"$f":"CONCATENATE(ADDRESS(ROW(CASH_PREV_PAY_RNG),COLUMN(CASH_PREV_PAY_RNG),,,$F$9),\":\",ADDRESS(ROW(CASH_PREV_PAY_RNG)+ROWS(CASH_PREV_PAY_RNG)-1,COLUMN(CASH_PREV_PAY_RNG)))","v":{"$error":"#NAME?"}}]
[]
[null,null,"Base Cap","CASH_PREV_BASE_CAP",null,25600]
[]
[null,null,"Base Price","CASH_PREV_BASE_PRICE",null,1600]
[null,null,"Adjusted Price","CASH_PREV_ADJUSTED_PRICE",null,{"$f":"IF(CASH_PREV_BASE_PRICE*CASH_PREV_PAY_ORDERS>CASH_PREV_BASE_CAP, CASH_PREV_BASE_CAP/CASH_PREV_PAY_ORDERS, CASH_PREV_BASE_PRICE)","v":{"$error":"#NAME?"}},null,null,null,null,"Once the Base Cap is exceeded the individual price adjusts so that all ordering markets that are not receiving a free report,"]
[null,null,null,null,null,null,null,null,null,null,"pay the same amount for the product"]
[null,null,"Current Price",null,null,"MKT",null,null,null,null,"Determined at the individual market level."]
[]
[null,null,"Total Pay Orders","CASH_PREV_PAY_ORDERS",null,{"$f":"SUM((CASH_PREV_PAY_RNG<>\"\")*(CASH_PREV_FREE_RNG=\"\"))","v":{"$error":"#NAME?"}}]
[]
[null,null,"Discount Details"]
[null,null,"Eligibility Requirement",null,null,"Market orders a TCM Cash Online report or a TCM Gen Ind Cash & LTI report."]
[null,null,null,null,null,"For GPCG clients, market orders TCM Cash Online, TCM Gen Ind Cash & LTI, TCM GPCG Cash & Prev. or TCM GPCG Cash & LTI"]
[null,null,"Who gets the discount",null,null,"Only the market(s) meeting the eligibility requirement"]
[null,null,"Product(s) discounted",null,null,"TCM Gen Ind Cash & Prev report"]
[null,null,"How the discount is applied",null,null,"TCM Gen Ind Cash & Prev report is reduced by 100%"]
[null,null,"How the discount is displayed",null,null,"When the Eligibility Requirement is met the space to the right of the Gen Ind Cash & Prev report will read \"Complimentary\""]
[]
[null,null,"Complimentary Orders"]
[]
[null,null,"Range Address",null,null,{"$f":"CONCATENATE(ADDRESS(ROW(CASH_PREV_FREE_RNG),COLUMN(CASH_PREV_FREE_RNG),,,$F$9),\":\",ADDRESS(ROW(CASH_PREV_FREE_RNG)+ROWS(CASH_PREV_FREE_RNG)-1,COLUMN(CASH_PREV_FREE_RNG)))","v":{"$error":"#NAME?"}}]
[]
[null,null,"Total Complimentary Orders","CASH_PREV_FREE_ORDERS",null,{"$f":"COUNTIF(CASH_PREV_FREE_RNG,FREE_TEXT)","v":{"$error":"#NAME?"}}]
[]
[null,"TCM Light"]
[]
[null,null,"Standard"]
[]
[null,null,"Base Price","TCM_LIGHT_BASE_PRICE",null,900,null,null,null,null,"No discounts or caps apply to this product"]
[null,null,"Current Price",null,null,"MKT",null,null,null,null,"Varies by market.  Becomes the Base Price for markets that place a TCM Light Report order unless the market falls into a special"]
[null,null,null,null,null,null,null,null,null,null,"category as indicated by its market code (see below) "]
[null,null,"Special1"]
[]
[null,null,"Base Price","TCM_LIGHT_SPECIAL1_BASE_PRICE",null,2250]
[null,null,"Market Code","TCM_LIGHT_SPECIAL1_CODE",null,"M31",null,null,null,null,"This price applies to New Zealand only"]
[]
[null,"TCM Cash Online"]
[]
[null,null,"Single Comparator Group"]
[]
[null,null,"Range Address","CASH_ONLINE_RNG",null,{"$f":"CONCATENATE(ADDRESS(ROW(CASH_ONLINE_RNG),COLUMN(CASH_ONLINE_RNG),,,$F$9),\":\",ADDRESS(ROW(CASH_ONLINE_RNG)+ROWS(CASH_ONLINE_RNG)-1,COLUMN(CASH_ONLINE_RNG)))","v":{"$error":"#NAME?"}}]
[]
[null,null,"Base Cap","CASH_ONLINE_BASE_CAP",null,38400]
[]
[null,null,"Base Price","CASH_ONLINE_BASE_PRICE",null,2400]
[null,null,"Adjusted Price","CASH_ONLINE_ADJUSTED_PRICE",null,{"$f":"IF(CASH_ONLINE_BASE_PRICE*CASH_ONLINE_ORDERS>CASH_ONLINE_BASE_CAP,CASH_ONLINE_BASE_CAP/CASH_ONLINE_ORDERS,CASH_ONLINE_BASE_PRICE)","v":{"$error":"#NAME?"}},null,null,null,null,"Once the Base Cap is exceeded the individual price adjusts so that all ordering markets pay the same amount for the product,"]
[null,null,"Current Price",null,null,"MKT",null,null,null,null,"Determined at the individual market level."]
[]
[null,null,"Total Current Orders","CASH_ONLINE_ORDERS",null,{"$f":"COUNTIF(CASH_ONLINE_RNG,\"<>\")","v":{"$error":"#NAME?"}}]
[]
[null,null,"Each additional Comparator Group"]
[]
[null,null,"Base Price","CASH_ONLINE_ADDITIONAL_GROUP",null,250,null,null,null,null,"This is not currently used in any calculations"]
[]
[null,"TCM Gen Ind Cash & LTI"]
[]
[null,null,"Base Price","CASH_LTI_BASE_PRICE",null,4500]
[null,null,"Current Price",null,null,"MKT",null,null,null,null,"Determined at the individual market level."]
[]
[null," TCM GPCG Cash & Prev."]
[]
[null,null,"Standard"]
[]
[null,null,"Range Address","GPCG_CASH_PREV_RNG",null,{"$f":"CONCATENATE(ADDRESS(ROW(GPCG_CASH_PREV_RNG),COLUMN(GPCG_CASH_PREV_RNG),,,$F$9),\":\",ADDRESS(ROW(GPCG_CASH_PREV_RNG)+ROWS(GPCG_CASH_PREV_RNG)-1,COLUMN(GPCG_CASH_PREV_RNG)))","v":{"$error":"#NAME?"}}]
[]
[null,null,"Base Cap","GPCG_CASH_PREV_BASE_CAP",null,32400]
[]
[null,null,"Base Price","GPCG_CASH_PREV_BASE_PRICE",null,1800]
[null,null,"Adjusted Price","GPCG_CASH_PREV_ADJUSTED_PRICE",null,{"$f":"IF(GPCG_CASH_PREV_BASE_PRICE * GPCG_CASH_PREV_ORDERS > GPCG_CASH_PREV_BASE_CAP, GPCG_CASH_PREV_BASE_CAP / GPCG_CASH_PREV_ORDERS, GPCG_CASH_PREV_BASE_PRICE)","v":{"$error":"#NAME?"}},null,null,null,null,"Once the Base Cap is exceeded the individual price adjusts so that all ordering markets pay the same amount for the product,"]
[null,null,"Current Price",null,null,"MKT",null,null,null,null,"Determined at the individual market level."]
[]
[null,null,"Total Current Orders","GPCG_CASH_PREV_ORDERS",null,{"$f":"COUNTIF(GPCG_CASH_PREV_RNG,\"<>\")","v":{"$error":"#NAME?"}}]
[]
[null," TCM GPCG Cash & LTI"]
[]
[null,null,"Standard"]
[]
[null,null,"Range Address","GPCG_CASH_LTI_RNG",null,{"$f":"CONCATENATE(ADDRESS(ROW(GPCG_CASH_LTI_RNG),COLUMN(GPCG_CASH_LTI_RNG),,,$F$9),\":\",ADDRESS(ROW(GPCG_CASH_LTI_RNG)+ROWS(GPCG_CASH_LTI_RNG)-1,COLUMN(GPCG_CASH_LTI_RNG)))","v":{"$error":"#NAME?"}}]
[]
[null,null,"Base Cap","GPCG_CASH_LTI_BASE_CAP",null,73800]
[]
[null,null,"Base Price","GPCG_CASH_LTI_BASE_PRICE",null,4100]
[null,null,"Adjusted Price","GPCG_CASH_LTI_ADJUSTED_PRICE",null,{"$f":"IF(GPCG_CASH_LTI_BASE_PRICE * GPCG_CASH_LTI_ORDERS > GPCG_CASH_LTI_BASE_CAP, GPCG_CASH_LTI_BASE_CAP / GPCG_CASH_LTI_ORDERS, GPCG_CASH_LTI_BASE_PRICE)","v":{"$error":"#NAME?"}},null,null,null,null,"Once the Base Cap is exceeded the individual price adjusts so that all ordering markets pay the same amount for the product,"]
[null,null,"Current Price",null,null,"MKT",null,null,null,null,"Determined at the individual market level."]
[]
[null,null,"Total Current Orders","GPCG_CASH_LTI_ORDERS",null,{"$f":"COUNTIF(GPCG_CASH_LTI_RNG,\"<>\")","v":{"$error":"#NAME?"}}]
[]
[null,"eGuides"]
[]
[null,null,"Base Cap","EGUIDE_BASE_CAP",null,5100]
[null,null,"Cap is met or exceeded","EGUIDE_CAP_MET",null,{"$f":" OR(#REF!=ORDER,( EGUIDE_MARKET_BASE_PRICE * EGUIDE_MARKET_ORDERS ) >= EGUIDE_BASE_CAP)","v":{"$error":"#REF!"}}]
[null,null,"Special Display Rule",null,null,null,null,null,null,null,"The Global Country eGuide box and all Market Country eGuide boxes receive green shading to indicate their inclusion if"]
[null,null,null,null,null,null,null,null,null,null,"1) Global Country eGuides are ordered or;"]
[null,null,null,null,null,null,null,null,null,null,"2) The Base Cap is met"]
[null,null,"Global"]
[]
[null,null,"Base Price","EGUIDE_GLOBAL_BASE_PRICE",null,5100]
[null,null,"Current Price","EGUIDE_GLOBAL_CURRENT_PRICE",null,{"$f":" EGUIDE_CAP_MET * EGUIDE_GLOBAL_BASE_PRICE","v":{"$error":"#NAME?"}},null,null,null,null,"This becomes the Base Price if the Global Country eGuides are ordered or;"]
[null,null,null,null,null,null,null,null,null,null,"the Base Cap price if the Base Cap is met through individual market orders"]
[null,null,"Market"]
[]
[null,null,"Range Address","EGUIDE_RNG",null,{"$f":"CONCATENATE(ADDRESS(ROW(EGUIDE_RNG),COLUMN(EGUIDE_RNG),,,$F$9),\":\",ADDRESS(ROW(EGUIDE_RNG)+ROWS(EGUIDE_RNG)-1,COLUMN(EGUIDE_RNG)))","v":{"$error":"#NAME?"}}]
[]
[null,null,"Base Price","EGUIDE_MARKET_BASE_PRICE",null,1000]
[null,null,"Total Market Orders","EGUIDE_MARKET_ORDERS",null,{"$f":"COUNTIF(EGUIDE_RNG,\"<>\")","v":{"$error":"#NAME?"}}]
[null,null,"Total Market Cost",null,null,{"$f":" ( NOT(EGUIDE_CAP_MET) ) * EGUIDE_MARKET_ORDERS * EGUIDE_MARKET_BASE_PRICE","v":{"$error":"#NAME?"}},null,null,null,null,"Once the Base Cap is met, this becomes zero and the price is recorded in the Global Country eGuide line item"]
[]
[null,"Salary Increase Survey (SIS)"]
[]
[null,null,"Global"]
[]
[null,null,"Base Price","SIS_GLOBAL_BASE_PRICE",null,300]
[null,null,"Current Price","SIS_GLOBAL_CURRENT_PRICE",null,{"$f":" IF(#REF!=ORDER,SIS_GLOBAL_BASE_PRICE * (1 - SIS_COMMIT_CURRENT_DISCOUNT),0)","v":{"$error":"#REF!"}}]
[]
[null,null,"Market Threshold","SIS_COMMIT_MARKETS",null,10]
[null,null,"Total Current Commitments","SIS_COMMIT_ORDERS",null,{"$f":"COUNTIF(SIS_COMMIT_RNG,\"<>\")","v":{"$error":"#NAME?"}}]
[]
[null,null,"Base Discount %","SIS_COMMIT_BASE_DISCOUNT",null,1]
[null,null,"Current Discount %","SIS_COMMIT_CURRENT_DISCOUNT",null,{"$f":"IF(SIS_COMMIT_ORDERS>=SIS_COMMIT_MARKETS,SIS_COMMIT_BASE_DISCOUNT,0)","v":{"$error":"#NAME?"}}]
[]
[null,null,"Discount Details"]
[null,null,"Eligibility Requirement",null,null,"Market Threshold must be met"]
[null,null,"Who gets the discount",null,null,"N/A"]
[null,null,"Product(s) discounted",null,null,"Global SIS Report Purchase"]
[null,null,"How the discount is applied",null,null,"Global SIS Report Purchase Price is reduced by the Current Discount % (100%)"]
[null,null,"How the discount is displayed",null,null,"When the Market Threshold is met the space to the right of the Global SIS Report Purchase will read \"Complimentary\""]
[]
[null,null,"Market"]
[]
[null,null,"Range Address","SIS_COMMIT_RNG",null,{"$f":"CONCATENATE(ADDRESS(ROW(SIS_COMMIT_RNG),COLUMN(SIS_COMMIT_RNG),,,$F$9),\":\",ADDRESS(ROW(SIS_COMMIT_RNG)+ROWS(SIS_COMMIT_RNG)-1,COLUMN(SIS_COMMIT_RNG)))","v":{"$error":"#NAME?"}}]
[]
[null,null,"Base Price","SIS_MARKET_BASE_PRICE",null,600]
[null,null,"Current Price",null,null,"MKT",null,null,null,null,"Determined at the individual market level."]
[]
[null,null,"Base Discount %","SIS_MARKET_BASE_DISCOUNT",null,1]
[null,null,"Current Discount %",null,null,"MKT",null,null,null,null,"Determined at the individual market level."]
[]
[null,null,"Discount Details"]
[null,null,"Eligibility Requirement",null,null,"SIS Participation Commitment box is marked with an \"x\""]
[null,null,"Who gets the discount",null,null,"Only the market(s) meeting the eligibility requirement"]
[null,null,"Product(s) discounted",null,null,"Market SIS Report Purchase"]
[null,null,"How the discount is applied",null,null,"Market SIS Report Purchase Price is reduced by the Current Discount % (100%)"]
[null,null,"How the discount is displayed",null,null,"When a market makes a SIS Participation Commitment the space to the right of the SIS Report Purchase will read \"Complimentary\""]
[]
[null,"Global Variable Pay"]
[]
[null,null,"Variable Pay - Globally Consistent Plan"]
[]
[null,null,"Base Price","VAR_PAY_GCP_BASE_PRICE",null,2000]
[]
[null,null,"Variable Pay - All Countries Summary"]
[]
[null,null,"Base Price","VAR_PAY_ACS_BASE_PRICE",null,1000]

{"sheet":"Introduction","index":1,"n_rows":40,"n_cols":4,"rows_kept":40,"cut":false,"hidden":false,"merged":[[33,1,33,5],[30,1,30,5],[31,1,31,5],[16,1,16,5],[17,1,17,5],[18,1,18,5],[21,1,21,5],[24,1,24,5],[27,1,27,5],[13,1,13,5],[6,1,6,5],[9,1,9,4],[10,1,10,5],[11,1,11,5]]}
[]
[]
[]
[]
[]
[]
[null,"Description of Community™ Market Surveys"]
[]
[null,"About Birches Group"]
[null,"Community Market surveys provide market intelligence for over 150 developing countries on a global basis.  Using  our unique survey methodology designed especially for developing markets, we provide a consistent and  reliable market profile across leading employers in all sectors.  "]
[]
[null,"Our markets are dynamic - and so are our surveys.  Every country is updated on an ongoing basis three times a year, in April, July and October.  You can join the survey at any time."]
[null," "]
[null,"We collect data from employers following their annual reviews using a simple and easy interview.  Our process is designed to be convenient for employers and minimize the time you  spend to prepare and submit data."]
[null,"  "]
[null,"Indigo™ Interactive Data Subscription "]
[null,"Our proprietary software, Indigo™ provides interactive access to your selected survey countries for 12 months. Using Indigo™, you can change survey assumptions (e.g., currency, percentiles), filter survey data by job or grade, and create customized outputs in Excel or PDF format.  If you use a survey aggregator to manage survey data from multiple suppliers, we can create a customized output for you for a modest fee."]
[null,"  "]
[null,"All Indigo™ users also get access to Birches Group Trends™, our tool to estimate market movement based on historical survey data."]
[]
[null,"Sustaining Partner Program"]
[null,"If you need data in a minimum of ten countries, consider becoming a Sustaining Partner.  Sustaining Partners agree to subscribe via Indigo™ for three consecutive years.   Sustaining fees make this option very cost-effective.  Clients partner with us to help expand survey participation to other employers of interest."]
[null,"  "]
[null,"Report Subscription"]
[null,"If you prefer to access survey data using preformatted reports, the Birches Group Report Subscription is the perfect solution.  Your 12-month subscription provides access to your selected survey countries via the Birches Group website.  All survey releases during the year are available, on demand, whenever you need data."]
[]
[null,"Multiple Users Included"]
[null,"You can include multiple users to either subscription option at no extra charge.  You can also combine different subscription options (e.g., Indigo™ access at headquarters, reports in country offices)."]
[]
[null,"Multiple Profiles Available"]
[null,"The NGO Local Pay Profile is the default standard profile for a Report Subscription or an Indigo™ Subscription. Our Multisector Profile, which includes international organizations, private sector companies and selected NGOs, is also available in every market. "]
[null,"Custom Profile\nBirches Group strongly advocates the use of a tailored comparator group whenever possible when assessing your market position.  You can select a custom cut profile of organizations selected from NGO and multi-sector profiles, according to your specific requirements and preferences.  The first custom cut for each country is included in the base survey fee.  Additional custom cuts can be added for a small additional fee.  Custom cuts can include employers from the NGO Local Pay and Multisector profiles."]
[]
[null,"Birches Group LLC"]
[]
[null,"Global Headquarters:",null,"Operations Centre:"]
[null,"228 East 45th Street, 12th Floor South",null,"Multinational Bancorporation Center, Unit 19B"]
[null,"New York, NY 10017",null,"6805 Ayala Avenue"]
[null,"USA",null,"1226 Makati City,"]
[null,null,null,"Philippines"]

{"sheet":"Survey Fees","index":2,"n_rows":25,"n_cols":4,"rows_kept":25,"cut":false,"hidden":false,"merged":[[24,1,24,3],[21,1,21,3],[22,1,22,3],[23,1,23,3],[5,1,5,3],[8,1,8,3],[16,2,16,3],[20,1,20,3],[6,1,6,3],[15,1,16,1]]}
[]
[]
[]
[]
[]
[null,"Community™ Market Compensation & Benefits Survey"]
[null,"Pricing for NGO and Development Sector Participants"]
[]
[null,"- - - - - - - All fees are Per Country Per Year in USD - - - - - - - "]
[null,"Service","Non-Profit NGOs","Commercial Development Organizations"]
[null,"One-Year Report Subscription\nwith Custom Cut\nIncludes NGO Profile",1295,"$1,750 per country\n$1,575 (10+ countries)"]
[null,"Sustaining Contributor \nThree-Year Report Subscription with Custom Cut\nIncludes NGO Profile","$1,145 average per year \n(11.5% discount)\n\n$1,295 in 1st year\n$1,295 in 2nd year\n$845 in 3rd year\n","$1,500 average per year \n(15% discount)\n\n$1,750 in 1st year\n$1,750 in 2nd year\n$1,000 in 3rd year\n"]
[null,"Indigo™ Access\n","Add-on of $205 per country\n*Includes NGO Profile","Based on number of countries:\n$2,000 (1-9 countries)\n$1,800 (10 or more countries)\nIncludes Custom Cut, NGO and Multisector Profiles"]
[null,"Sustaining Partner Subscription with Custom Cut\n*Includes NGO & Multisector profiles plus Indigo™ Access\n\n*Requires a minimum of ten countries and a three-year commitment\n","$850 per country\n(50% discount)","$1,275 per country\n(29% discount)"]
[null,"Multisector Add-on ",200,"$250\n(Reports Only)"]
[null,"Additional Custom Cuts",400,400]
[null,null,"Sustaining Partners receive a 50% discount on Additional Custom Cuts"]
[null,"Expedited Report Fee",450,450]
[null,"Single Job Profile Report","$375 per job\n(includes custom cut)","$550 per job\n(includes custom cut)"]
[]
[null,"NGO Local Pay is a survey designed to support the international NGO and development community.  As a community product, the survey’s effectiveness is directly impacted by the level of participation from the community.  Therefore, we generally require survey participation in order to subscribe. "]
[null,"On a limited basis, organizations can purchase Report Subscriptions without participating in the survey.  This option is available only when an organization is not yet operating in-country.  The price is $1,950 per country for non-profit NGOs and $3,000 per country for commercial development organizations."]
[null,"If you select a country in which there is currently no NGO Profile, your subscription will automatically revert to multisector (but the fee for multisector profile will not apply).  If during your subscription period, an NGO Profile becomes available, you will automatically receive access to the NGO Profile at no added cost."]
[]
[null,"All fees are expressed net of tax.  If any income tax, withholding tax, VAT or similar taxes are payable, the invoice amount will be increased (grossed-up) and taxes will be withheld from the resulting balance.  This ensures full compliance with local laws and requirements."]

{"sheet":"Order Form","index":3,"n_rows":105,"n_cols":40,"rows_kept":105,"cut":false,"hidden":false,"merged":[[65,2,65,57],[56,14,56,23],[55,6,55,23],[55,31,55,36],[55,44,55,57],[54,31,54,57],[51,27,51,36],[48,25,48,26],[61,2,61,6],[61,8,61,17],[62,2,62,7],[62,8,62,17],[62,27,62,56],[60,8,60,17],[61,27,61,56],[60,20,60,23],[61,20,61,23],[9,1,9,57],[43,2,43,5],[48,2,48,23],[37,25,37,26],[37,27,37,36],[37,39,37,57],[34,2,34,57],[36,25,36,26],[39,39,39,57],[10,2,10,57],[44,14,44,23],[44,2,44,13],[42,2,42,5],[42,27,42,30],[43,27,43,30],[11,2,12,57],[37,2,37,12],[36,2,36,23],[36,27,36,36],[36,39,36,57],[39,2,39,11],[39,14,39,23],[39,27,39,36],[42,6,42,23],[107,3,107,55],[108,3,108,55],[104,2,104,10],[104,11,104,27],[104,29,104,57],[100,11,100,27],[100,29,100,57],[94,4,94,56],[95,4,95,56],[100,2,100,10],[97,3,97,55],[98,2,98,9],[98,10,98,13],[102,11,102,27],[102,29,102,57],[102,2,102,10],[13,2,13,57],[14,2,14,57],[15,2,15,57],[73,4,73,56],[74,4,74,56],[75,4,75,56],[76,4,76,56],[77,4,77,56],[58,2,58,18],[60,2,60,7],[63,8,63,17],[30,3,30,57],[31,3,31,57],[21,3,21,57],[32,3,32,57],[17,7,17,27],[18,7,18,27],[42,31,42,57],[43,6,43,23],[43,31,43,36],[43,44,43,57],[51,2,51,11],[48,27,48,36],[48,39,48,57],[22,3,22,57],[92,4,92,56],[93,4,93,56],[96,4,96,56],[84,4,84,56],[85,4,85,56],[88,4,88,56],[90,4,90,56],[91,4,91,56],[78,4,78,56],[79,4,79,56],[80,4,80,56],[82,4,82,56],[83,4,83,56],[69,4,69,54],[68,4,68,56],[70,4,70,56],[71,4,71,56],[72,4,72,56],[86,4,86,56],[87,4,87,56],[51,14,51,23],[66,2,66,57],[51,39,51,57],[20,2,20,57],[17,33,17,53],[18,33,18,53],[17,29,17,32],[18,3,18,6],[18,29,18,32],[19,3,19,6],[19,7,19,57],[17,3,17,6],[23,3,23,57],[24,3,24,57],[25,3,25,57],[26,3,26,57],[27,3,27,57],[28,3,28,57],[29,3,29,57],[54,6,54,23],[58,27,58,57]]}
[]
[]
[]
[]
[]
[]
[]
[]
[]
[null,"Community™ Market Compensation & Benefits Survey"]
[null,null,"Registration Form for NGOs and Commercial Development Organizations"]
[null,null,"Please refer to the following steps to ensure your order can be completed quickly and accurately"]
[]
[null,null,"A completed order form is required for all survey requests.  This worksheet uses macros.  If you receive a warning about this, please click Enable."]
[]
[null,null,"The Order Form is divided up into sections, and the tabs are color coded by section.  "]
[]
[null,null,null,null,null,null,null,"Introduction and other background information",null,null,null,null,null,null,null,null,null,null,null,null,null,null,null,null,null,null,null,null,null,null,null,null,null,"This tab is used to select countries for your subscription"]
[null,null,null,null,null,null,null,"This tab, and Order Forms for each type of registration",null,null,null,null,null,null,null,null,null,null,null,null,null,null,null,null,null,null,null,null,null,null,null,null,null,"These are the tabs to report contact information"]
[null,null,null,null,null,null,null,"Subscription Agreement, which must be executed for all orders"]
[]
[null,null,null,"The Order Process has seven (7) steps"]
[null,null,1,"All orders start on this page, the Order Form tab.  Once completed, click Select Countries to make your country selections."]
[null,null,2,"When finished selecting countries, click Submit and the order form for your selected type of registration will be displayed."]
[null,null,3,"Complete the YELLOW sections in order to confirm the various survey options.  Note that you can copy and paste within the yellow cells to save time."]
[null,null,4,"After filling in your choices, you agree to our Terms and Conditions via the Subscription Agreement.  Click the link to review the agreement, and then check the box on the agreement to accept the terms and conditions.  Click Return to Order Form to continue."]
[null,null,5,"Below the Subscription Agreement section is a place to indicate any special instructions.  If you have special billing requirements, please indicate them here."]
[null,null,6,"The Country Information section should be completed next.  This information assists our team in organizing data collection for the survey."]
[null,null,7,"Finally, you need to provide three types of contact information:"]
[null,null,null,"  - Survey Access:  The names of the individuals who will  access the survey results, and for which countries they should get access"]
[null,null,null,"  - Survey Contacts:  The names of the individuals who will provide your organization's data for the survey"]
[null,null,null,"  - HQ and Regional Contacts:  The names of the individuals at headquarters and in regional offices with oversight of HR for each country"]
[null,null,null,"If you cannot complete all contact information, please send what you have, and then send the additional information using the same order form."]
[]
[null,null,"Click on a cell to enter data.  Use TAB to move to the next field."]
[null,null,"Purchase Authorized by"]
[]
[null,null,"Organization (Subscriber)",null,null,null,null,null,null,null,null,null,null,null,null,null,null,null,null,null,null,null,null,null,null,"Title",null,"Given Name(s)",null,null,null,null,null,null,null,null,null,null,null,"Surname(s)"]
[]
[]
[null,null,"Job Title",null,null,null,null,null,null,null,null,null,null,null,"Email",null,null,null,null,null,null,null,null,null,null,null,null,"Phone (including country code)",null,null,null,null,null,null,null,null,null,null,null,"Skype Address"]
[]
[null,null,"Address 1",null,null,null,null,null,null,null,null,null,null,null,null,null,null,null,null,null,null,null,null,null,null,null,null,"Address 2"]
[null,null,"City",null,null,null,null,null,null,null,null,null,null,null,null,null,null,null,null,null,null,null,null,null,null,null,null,"Country",null,null,null,null,null,null,null,null,null,null,null,"Postal Code"]
[null,null,"State/Province (US/Canada only)"]
[]
[]
[null,null,"Billing Contact Information (if different than purchaser)"]
[]
[null,null,"Company",null,null,null,null,null,null,null,null,null,null,null,null,null,null,null,null,null,null,null,null,null,null,"Title",null,"Given Name(s)",null,null,null,null,null,null,null,null,null,null,null,"Surname(s)"]
[]
[]
[null,null,"Job Title",null,null,null,null,null,null,null,null,null,null,null,"Email",null,null,null,null,null,null,null,null,null,null,null,null,"Phone (including country code)",null,null,null,null,null,null,null,null,null,null,null,"Skype Address"]
[]
[null,null,"Address 1",null,null,null,null,null,null,null,null,null,null,null,null,null,null,null,null,null,null,null,null,null,null,null,null,"Address 2"]
[null,null,"City",null,null,null,null,null,null,null,null,null,null,null,null,null,null,null,null,null,null,null,null,null,null,null,null,"Country",null,null,null,null,null,null,null,null,null,null,null,"Postal Code"]
[null,null,"State/Province (US/Canada only)"]
[]
[null,null,"(Birches Group use only)"]
[null,null,null,null,null,null,null,null,null,null,null,null,null,null,null,null,null,null,null,null,"Currency:",null,null,null,null,null,null,"Purchase Order Number (optional)"]
[null,null,"Order Number:",null,null,null,null,null,null,null,null,null,null,null,null,null,null,null,null,null,"USD"]
[null,null,"Subsector:",null,null,null,null,null,null,null,null,null,null,null,null,null,null,null,null,null,"No",null,null,null,null,null,null,"Please send invoice copies to (enter email addresses with commas in between):"]
[null,null,"Sales Rep:"]
[null,null,"Account Number:"]
[]
[]
[null,null,"    Product Selection"]
[]
[null,null,null,null,"Birches Group offers three (3) different options for NGOs and Commercial Development Organizations .  You must select one option in order to continue with your order:"]
[]
[null,null,null,null,"Option 1 - Sustaining Partner"]
[]
[null,null,null,null,"  The requirements for Sustaining Partner subscriptions are:"]
[]
[null,null,null,null,"    1)  Registration in a minimum of ten (10) countries"]
[null,null,null,null,"    2)  Registration commitment for three (3) years"]
[null,null,null,null,"    3)  This form can be used for subscriptions up to sixty (60) countries.  For larger subscriptions, please contact us."]
[]
[null,null,null,null,"Sustaining Partners automatically get access to NGO and Multisector profiles, and Indigo™ access, for all subscribed countries,"]
[null,null,null,null,"  and a 50% discount on additional custom cuts."]
[]
[]
[null,null,null,null,"Option 2 - Sustaining Contributor"]
[]
[null,null,null,null,"  The requirements for Sustaining Contributor subscriptions are:"]
[]
[null,null,null,null,"    1)  Registration for up to nine (9) countries"]
[null,null,null,null,"    2)  Registration commitment for three (3) years"]
[]
[]
[null,null,null,null,"Option 3 - Ad-Hoc Subscription"]
[]
[null,null,null,null,"  The requirements for Ad-Hoc Subscriptions are:"]
[]
[null,null,null,null,"    1)  Registration for one (1) or more countries"]
[null,null,null,null,"    2)  Registration commitment for one (1) year"]
[]
[]
[null,null,"      Make entries in the ",null,null,null,null,null,null,null,"YELLOW",null,null,null,"cells only in this section."]
[]
[null,null,"      My organization is a:",null,null,null,null,null,null,null,null,"Type of Organization",null,null,null,null,null,null,null,null,null,null,null,null,null,null,null,null,null,"You must select the TYPE OF ORGANIZATION"]
[]
[null,null,"      Product Option:",null,null,null,null,null,null,null,null,"Product Option",null,null,null,null,null,null,null,null,null,null,null,null,null,null,null,null,null,"You must select a PRODUCT OPTION"]
[]
[null,null,"Subscription Start Date:",null,null,null,null,null,null,null,null,null,null,null,null,null,null,null,null,null,null,null,null,null,null,null,null,null,null,"You must enter a DATE"]

{"sheet":"Order Form (SP)","index":4,"n_rows":228,"n_cols":152,"rows_kept":228,"cut":false,"hidden":false,"merged":[[214,40,214,48],[214,49,214,56],[215,40,215,48],[215,49,215,56],[216,40,216,48],[216,49,216,56],[217,40,217,48],[217,49,217,56],[209,40,209,48],[209,49,209,56],[210,40,210,48],[210,49,210,56],[211,40,211,48],[211,49,211,56],[212,40,212,48],[212,49,212,56],[213,40,213,48],[213,49,213,56],[204,40,204,48],[204,49,204,56],[205,40,205,48],[205,49,205,56],[206,40,206,48],[206,49,206,56],[207,40,207,48],[207,49,207,56],[208,40,208,48],[208,49,208,56],[199,40,199,48],[199,49,199,56],[200,40,200,48],[200,49,200,56],[201,40,201,48],[201,49,201,56],[202,40,202,48],[202,49,202,56],[203,40,203,48],[203,49,203,56],[194,40,194,48],[194,49,194,56],[195,40,195,48],[195,49,195,56],[196,40,196,48],[196,49,196,56],[197,40,197,48],[197,49,197,56],[198,40,198,48],[198,49,198,56],[189,40,189,48],[189,49,189,56],[190,40,190,48],[190,49,190,56],[191,40,191,48],[191,49,191,56],[192,40,192,48],[192,49,192,56],[193,40,193,48],[193,49,193,56],[184,40,184,48],[184,49,184,56],[185,40,185,48],[185,49,185,56],[186,40,186,48],[186,49,186,56],[187,40,187,48],[187,49,187,56],[188,40,188,48],[188,49,188,56],[179,40,179,48],[179,49,179,56],[180,40,180,48],[180,49,180,56],[181,40,181,48],[181,49,181,56],[182,40,182,48],[182,49,182,56],[183,40,183,48],[183,49,183,56],[174,40,174,48],[174,49,174,56],[175,40,175,48],[175,49,175,56],[176,40,176,48],[176,49,176,56],[177,40,177,48],[177,49,177,56],[178,40,178,48],[178,49,178,56],[169,40,169,48],[169,49,169,56],[170,40,170,48],[170,49,170,56],[171,40,171,48],[171,49,171,56],[172,40,172,48],[172,49,172,56],[173,40,173,48],[173,49,173,56],[164,40,164,48],[164,49,164,56],[165,40,165,48],[165,49,165,56],[166,40,166,48],[166,49,166,56],[167,40,167,48],[167,49,167,56],[168,40,168,48],[168,49,168,56],[159,40,159,48],[159,49,159,56],[160,40,160,48],[160,49,160,56],[161,40,161,48],[161,49,161,56],[162,40,162,48],[162,49,162,56],[163,40,163,48],[163,49,163,56],[51,84,51,94],[51,95,51,112],[51,113,51,121],[51,122,51,123],[51,124,51,133],[113,12,113,15],[113,17,113,24],[49,73,49,74],[49,76,49,78],[54,12,54,15],[54,17,54,24],[56,12,56,15],[56,17,56,24],[55,12,55,15],[62,12,62,15],[62,17,62,24],[61,12,61,15],[61,17,61,24],[60,12,60,15],[60,17,60,24],[59,12,59,15],[59,17,59,24],[55,17,55,24],[58,12,58,15],[115,42,115,46],[116,42,116,46],[17,2,17,12],[17,25,17,26],[17,27,17,36],[17,39,17,57],[19,2,19,11],[19,14,19,23],[19,27,19,36],[19,39,19,57],[28,2,28,23],[28,25,28,26],[28,27,28,36],[28,39,28,57],[35,6,35,23],[35,31,35,36],[35,44,35,57],[36,14,36,23],[38,27,38,57],[31,2,31,11],[31,14,31,23],[31,27,31,36],[31,39,31,57],[34,6,34,23],[9,1,9,57],[10,2,10,57],[11,2,12,57],[14,2,14,57],[16,2,16,23],[16,25,16,26],[16,27,16,36],[16,39,16,57],[24,2,24,13],[24,14,24,23],[22,2,22,5],[22,6,22,23],[22,27,22,30],[22,31,22,57],[23,2,23,5],[23,6,23,23],[23,27,23,30],[23,31,23,36],[23,44,23,57],[52,3,52,10],[52,12,52,15],[53,12,53,15],[53,17,53,24],[34,31,34,57],[49,3,49,52],[51,3,51,10],[51,12,51,15],[51,17,51,24],[43,3,43,54],[45,3,45,55],[46,3,46,55],[39,8,39,17],[39,2,39,7],[39,18,39,23],[38,2,38,23],[51,26,51,33],[52,26,52,33],[53,26,53,33],[52,46,52,50],[40,18,40,23],[58,17,58,24],[57,12,57,15],[57,17,57,24],[67,12,67,15],[67,17,67,24],[66,12,66,15],[66,17,66,24],[65,12,65,15],[65,17,65,24],[64,12,64,15],[64,17,64,24],[63,12,63,15],[63,17,63,24],[72,12,72,15],[72,17,72,24],[71,12,71,15],[71,17,71,24],[70,12,70,15],[70,17,70,24],[69,12,69,15],[69,17,69,24],[68,12,68,15],[68,17,68,24],[77,12,77,15],[77,17,77,24],[76,12,76,15],[76,17,76,24],[75,12,75,15],[75,17,75,24],[74,12,74,15],[74,17,74,24],[73,12,73,15],[73,17,73,24],[82,12,82,15],[82,17,82,24],[81,12,81,15],[81,17,81,24],[80,12,80,15],[80,17,80,24],[79,12,79,15],[79,17,79,24],[78,12,78,15],[78,17,78,24],[87,12,87,15],[87,17,87,24],[86,12,86,15],[86,17,86,24],[85,12,85,15],[85,17,85,24],[84,12,84,15],[84,17,84,24],[83,12,83,15],[83,17,83,24],[92,12,92,15],[92,17,92,24],[91,12,91,15],[91,17,91,24],[90,12,90,15],[90,17,90,24],[89,12,89,15],[89,17,89,24],[88,12,88,15],[88,17,88,24],[97,12,97,15],[97,17,97,24],[96,12,96,15],[96,17,96,24],[95,12,95,15],[95,17,95,24],[94,12,94,15],[94,17,94,24],[93,12,93,15],[93,17,93,24],[102,12,102,15],[102,17,102,24],[101,12,101,15],[101,17,101,24],[100,12,100,15],[100,17,100,24],[99,12,99,15],[99,17,99,24],[98,12,98,15],[98,17,98,24],[107,12,107,15],[107,17,107,24],[106,12,106,15],[106,17,106,24],[105,12,105,15],[105,17,105,24],[104,12,104,15],[104,17,104,24],[103,12,103,15],[103,17,103,24],[112,12,112,15],[112,17,112,24],[111,12,111,15],[111,17,111,24],[110,12,110,15],[110,17,110,24],[109,12,109,15],[109,17,109,24],[108,12,108,15],[108,17,108,24],[118,3,118,10],[118,17,118,23],[118,26,118,34],[117,3,117,10],[117,17,117,23],[117,26,117,34],[117,11,117,16],[118,11,118,16],[115,12,115,15],[115,17,115,23],[115,26,115,34],[116,6,116,10],[116,17,116,23],[116,26,116,34],[116,11,116,16],[131,2,131,57],[132,2,132,57],[133,2,133,57],[135,2,135,57],[136,2,136,57],[137,2,137,57],[119,3,119,10],[130,2,130,57],[125,4,125,19],[126,4,126,19],[126,20,126,25],[125,20,125,25],[125,30,125,55],[125,27,125,29],[119,11,119,16],[157,4,157,12],[157,13,157,21],[157,22,157,30],[157,31,157,39],[158,4,158,12],[158,13,158,21],[158,22,158,30],[158,31,158,39],[138,2,138,57],[141,2,141,57],[142,2,148,57],[151,3,151,57],[152,3,152,57],[155,31,156,39],[156,4,156,12],[156,13,156,21],[156,22,156,30],[153,3,153,39],[155,40,156,48],[155,49,156,56],[157,40,157,48],[157,49,157,56],[158,40,158,48],[158,49,158,56],[161,4,161,12],[161,13,161,21],[161,22,161,30],[161,31,161,39],[162,4,162,12],[162,13,162,21],[162,22,162,30],[162,31,162,39],[159,4,159,12],[159,13,159,21],[159,22,159,30],[159,31,159,39],[160,4,160,12],[160,13,160,21],[160,22,160,30],[160,31,160,39],[165,4,165,12],[165,13,165,21],[165,22,165,30],[165,31,165,39],[166,4,166,12],[166,13,166,21],[166,22,166,30],[166,31,166,39],[163,4,163,12],[163,13,163,21],[163,22,163,30],[163,31,163,39],[164,4,164,12],[164,13,164,21],[164,22,164,30],[164,31,164,39],[169,4,169,12],[169,13,169,21],[169,22,169,30],[169,31,169,39],[170,4,170,12],[170,13,170,21],[170,22,170,30],[170,31,170,39],[167,4,167,12],[167,13,167,21],[167,22,167,30],[167,31,167,39],[168,4,168,12],[168,13,168,21],[168,22,168,30],[168,31,168,39],[173,4,173,12],[173,13,173,21],[173,22,173,30],[173,31,173,39],[174,4,174,12],[174,13,174,21],[174,22,174,30],[174,31,174,39],[171,4,171,12],[171,13,171,21],[171,22,171,30],[171,31,171,39],[172,4,172,12],[172,13,172,21],[172,22,172,30],[172,31,172,39],[177,4,177,12],[177,13,177,21],[177,22,177,30],[177,31,177,39],[178,4,178,12],[178,13,178,21],[178,22,178,30],[178,31,178,39],[175,4,175,12],[175,13,175,21],[175,22,175,30],[175,31,175,39],[176,4,176,12],[176,13,176,21],[176,22,176,30],[176,31,176,39],[181,4,181,12],[181,13,181,21],[181,22,181,30],[181,31,181,39],[182,4,182,12],[182,13,182,21],[182,22,182,30],[182,31,182,39],[179,4,179,12],[179,13,179,21],[179,22,179,30],[179,31,179,39],[180,4,180,12],[180,13,180,21],[180,22,180,30],[180,31,180,39],[185,4,185,12],[185,13,185,21],[185,22,185,30],[185,31,185,39],[186,4,186,12],[186,13,186,21],[186,22,186,30],[186,31,186,39],[183,4,183,12],[183,13,183,21],[183,22,183,30],[183,31,183,39],[184,4,184,12],[184,13,184,21],[184,22,184,30],[184,31,184,39],[189,4,189,12],[189,13,189,21],[189,22,189,30],[189,31,189,39],[190,4,190,12],[190,13,190,21],[190,22,190,30],[190,31,190,39],[187,4,187,12],[187,13,187,21],[187,22,187,30],[187,31,187,39],[188,4,188,12],[188,13,188,21],[188,22,188,30],[188,31,188,39],[193,4,193,12],[193,13,193,21],[193,22,193,30],[193,31,193,39],[194,4,194,12],[194,13,194,21],[194,22,194,30],[194,31,194,39],[191,4,191,12],[191,13,191,21],[191,22,191,30],[191,31,191,39],[192,4,192,12],[192,13,192,21],[192,22,192,30],[192,31,192,39],[197,4,197,12],[197,13,197,21],[197,22,197,30],[197,31,197,39],[198,4,198,12],[198,13,198,21],[198,22,198,30],[198,31,198,39],[195,4,195,12],[195,13,195,21],[195,22,195,30],[195,31,195,39],[196,4,196,12],[196,13,196,21],[196,22,196,30],[196,31,196,39],[201,4,201,12],[201,13,201,21],[201,22,201,30],[201,31,201,39],[202,4,202,12],[202,13,202,21],[202,22,202,30],[202,31,202,39],[199,4,199,12],[199,13,199,21],[199,22,199,30],[199,31,199,39],[200,4,200,12],[200,13,200,21],[200,22,200,30],[200,31,200,39],[205,4,205,12],[205,13,205,21],[205,22,205,30],[205,31,205,39],[206,4,206,12],[206,13,206,21],[206,22,206,30],[206,31,206,39],[203,4,203,12],[203,13,203,21],[203,22,203,30],[203,31,203,39],[204,4,204,12],[204,13,204,21],[204,22,204,30],[204,31,204,39],[209,4,209,12],[209,13,209,21],[209,22,209,30],[209,31,209,39],[210,4,210,12],[210,13,210,21],[210,22,210,30],[210,31,210,39],[207,4,207,12],[207,13,207,21],[207,22,207,30],[207,31,207,39],[208,4,208,12],[208,13,208,21],[208,22,208,30],[208,31,208,39],[214,22,214,30],[214,31,214,39],[211,4,211,12],[211,13,211,21],[211,22,211,30],[211,31,211,39],[212,4,212,12],[212,13,212,21],[212,22,212,30],[212,31,212,39],[117,42,117,46],[118,42,118,46],[49,64,49,68],[49,69,49,72],[41,8,41,17],[219,2,219,57],[222,2,222,57],[224,14,224,25],[40,2,40,7],[40,8,40,17],[215,4,215,12],[215,13,215,21],[215,22,215,30],[215,31,215,39],[216,4,216,12],[216,13,216,21],[216,22,216,30],[216,31,216,39],[213,4,213,12],[213,13,213,21],[213,22,213,30],[213,31,213,39],[214,4,214,12],[214,13,214,21],[54,26,54,33],[55,26,55,33],[56,26,56,33],[57,26,57,33],[58,26,58,33],[59,26,59,33],[60,26,60,33],[61,26,61,33],[62,26,62,33],[63,26,63,33],[64,26,64,33],[65,26,65,33],[66,26,66,33],[67,26,67,33],[68,26,68,33],[69,26,69,33],[70,26,70,33],[71,26,71,33],[72,26,72,33],[73,26,73,33],[74,26,74,33],[75,26,75,33],[76,26,76,33],[77,26,77,33],[78,26,78,33],[79,26,79,33],[80,26,80,33],[81,26,81,33],[82,26,82,33],[83,26,83,33],[84,26,84,33],[85,26,85,33],[86,26,86,33],[87,26,87,33],[88,26,88,33],[89,26,89,33],[90,26,90,33],[91,26,91,33],[92,26,92,33],[93,26,93,33],[94,26,94,33],[95,26,95,33],[96,26,96,33],[97,26,97,33],[98,26,98,33],[99,26,99,33],[100,26,100,33],[101,26,101,33],[102,26,102,33],[103,26,103,33],[104,26,104,33],[105,26,105,33],[106,26,106,33],[107,26,107,33],[108,26,108,33],[109,26,109,33],[110,26,110,33],[111,26,111,33],[112,26,112,33],[51,35,51,39],[53,35,53,39],[62,35,62,39],[63,35,63,39],[64,35,64,39],[65,35,65,39],[66,35,66,39],[67,35,67,39],[68,35,68,39],[69,35,69,39],[70,35,70,39],[71,35,71,39],[72,35,72,39],[73,35,73,39],[74,35,74,39],[75,35,75,39],[76,35,76,39],[54,35,54,39],[55,35,55,39],[56,35,56,39],[57,35,57,39],[58,35,58,39],[59,35,59,39],[60,35,60,39],[61,35,61,39],[77,35,77,39],[78,35,78,39],[79,35,79,39],[80,35,80,39],[81,35,81,39],[82,35,82,39],[83,35,83,39],[84,35,84,39],[85,35,85,39],[86,35,86,39],[87,35,87,39],[88,35,88,39],[89,35,89,39],[90,35,90,39],[91,35,91,39],[92,35,92,39],[93,35,93,39],[94,35,94,39],[95,35,95,39],[96,35,96,39],[97,35,97,39],[98,35,98,39],[99,35,99,39],[100,35,100,39],[101,35,101,39],[102,35,102,39],[103,35,103,39],[113,35,113,39],[115,35,115,39],[116,35,116,39],[117,35,117,39],[118,35,118,39],[104,35,104,39],[105,35,105,39],[106,35,106,39],[107,35,107,39],[108,35,108,39],[109,35,109,39],[110,35,110,39],[111,35,111,39],[112,35,112,39]]}
[]
[]
[]
[]
[]
[]
[]
[]
[]
[null,"Community™ Market Compensation & Benefits Survey"]
[null,null,"Registration Form for NGOs and Commercial Development Organizations"]
[null,null,"Please fill out this form completely in order to ensure your subscription can be processed quickly"]
[]
[]
[]
[null,null,"Purchase Authorized by"]
[null,null,{"$f":"IF(ISBLANK(OrgName),\"\",OrgName)","v":""},null,null,null,null,null,null,null,null,null,null,null,null,null,null,null,null,null,null,null,null,null,null,null,null,{"$f":"IF(ISBLANK(SubscriberFirstName),\"\",SubscriberFirstName)","v":""},null,null,null,null,null,null,null,null,null,null,null,{"$f":"IF(ISBLANK(SubscriberLastName),\"\",SubscriberLastName)","v":""}]
[null,null,"Organization (Subscriber)",null,null,null,null,null,null,null,null,null,null,null,null,null,null,null,null,null,null,null,null,null,null,"Title",null,"Given Name(s)",null,null,null,null,null,null,null,null,null,null,null,"Surname(s)"]
[]
[null,null,{"$f":"IF(ISBLANK(SubscriberTitle),\"\",SubscriberTitle)","v":""},null,null,null,null,null,null,null,null,null,null,null,{"$f":"IF(ISBLANK(SubscriberEmail),\"\",SubscriberEmail)","v":""},null,null,null,null,null,null,null,null,null,null,null,null,{"$f":"IF(ISBLANK(SubscriberPhone),\"\",SubscriberPhone)","v":""},null,null,null,null,null,null,null,null,null,null,null,{"$f":"IF(ISBLANK(SubscriberSkype),\"\",SubscriberSkype)","v":""}]
[null,null,"Job Title",null,null,null,null,null,null,null,null,null,null,null,"Email",null,null,null,null,null,null,null,null,null,null,null,null,"Phone (including country code)",null,null,null,null,null,null,null,null,null,null,null,"Skype Address"]
[]
[null,null,"Address 1",null,null,null,{"$f":"IF(ISBLANK(SubscriberAddress1),\"\",SubscriberAddress1)","v":""},null,null,null,null,null,null,null,null,null,null,null,null,null,null,null,null,null,null,null,null,"Address 2",null,null,null,{"$f":"IF(ISBLANK(SubscriberAddress2),\"\",SubscriberAddress2)","v":""}]
[null,null,"City",null,null,null,{"$f":"IF(ISBLANK(SubscriberCity),\"\",SubscriberCity)","v":""},null,null,null,null,null,null,null,null,null,null,null,null,null,null,null,null,null,null,null,null,"Country",null,null,null,{"$f":"IF(ISBLANK(SubscriberCountry),\"\",SubscriberCountry)","v":""},null,null,null,null,null,null,null,"Postal Code",null,null,null,null,{"$f":"IF(ISBLANK(SubscriberPostalCode),\"\",SubscriberPostalCode)","v":""}]
[null,null,"State/Province (US/Canada only)",null,null,null,null,null,null,null,null,null,null,null,{"$f":"IF(ISBLANK(SubscriberState),\"\",SubscriberState)","v":""}]
[]
[]
[null,null,"Billing Contact Information (if different than purchaser)"]
[null,null,{"$f":"IF(ISBLANK(BillingOrgName),\"\",BillingOrgName)","v":""},null,null,null,null,null,null,null,null,null,null,null,null,null,null,null,null,null,null,null,null,null,null,{"$f":"IF(ISBLANK(BillingSalutation),\"\",BillingSalutation)","v":""},null,{"$f":"IF(ISBLANK(BillingGivenNames),\"\",BillingGivenNames)","v":""},null,null,null,null,null,null,null,null,null,null,null,{"$f":"IF(ISBLANK(BillingSurnames),\"\",BillingSurnames)","v":""}]
[null,null,"Company",null,null,null,null,null,null,null,null,null,null,null,null,null,null,null,null,null,null,null,null,null,null,"Title",null,"Given Name(s)",null,null,null,null,null,null,null,null,null,null,null,"Surname(s)"]
[]
[null,null,{"$f":"IF(ISBLANK(BillingJobTitle),\"\",BillingJobTitle)","v":""},null,null,null,null,null,null,null,null,null,null,null,{"$f":"IF(ISBLANK(BillingEmail),\"\",BillingEmail)","v":""},null,null,null,null,null,null,null,null,null,null,null,null,{"$f":"IF(ISBLANK(BillingPhone),\"\",BillingPhone)","v":""},null,null,null,null,null,null,null,null,null,null,null,{"$f":"IF(ISBLANK(BillingSkype),\"\",BillingSkype)","v":""}]
[null,null,"Job Title",null,null,null,null,null,null,null,null,null,null,null,"Email",null,null,null,null,null,null,null,null,null,null,null,null,"Phone (including country code)",null,null,null,null,null,null,null,null,null,null,null,"Skype Address"]
[]
[null,null,"Address 1",null,null,null,{"$f":"IF(ISBLANK(BillingAddress1),\"\",BillingAddress1)","v":""},null,null,null,null,null,null,null,null,null,null,null,null,null,null,null,null,null,null,null,null,"Address 2",null,null,null,{"$f":"IF(ISBLANK(BillingAddress2),\"\",BillingAddress2)","v":""}]
[null,null,"City",null,null,null,{"$f":"IF(ISBLANK(BillingCity),\"\",BillingCity)","v":""},null,null,null,null,null,null,null,null,null,null,null,null,null,null,null,null,null,null,null,null,"Country",null,null,null,{"$f":"IF(ISBLANK(BillingCountry),\"\",BillingCountry)","v":""},null,null,null,null,null,null,null,"Postal Code",null,null,null,null,{"$f":"IF(ISBLANK(BillingPostalCode),\"\",BillingPostalCode)","v":""}]
[null,null,"State/Province (US/Canada only)",null,null,null,null,null,null,null,null,null,null,null,{"$f":"IF(ISBLANK(BillingState),\"\",BillingState)","v":""}]
[]
[null,null,"(Birches Group use only)",null,null,null,null,null,null,null,null,null,null,null,null,null,null,null,null,null,null,null,null,null,null,null,null,{"$f":"IF(ISBLANK(PurchaseOrderNo),\"\",PurchaseOrderNo)","v":""}]
[null,null,"Account Number:",null,null,null,null,null,{"$f":"AccountNumber","v":0},null,null,null,null,null,null,null,null,null,{"$f":"'Order Form'!U61","v":"USD"},null,null,null,null,null,null,null,null,"Purchase Order Number (optional)"]
[null,null,"Order Number:",null,null,null,null,null,{"$f":"OrderNumber","v":0},null,null,null,null,null,null,null,null,null,{"$f":"PriorPrice","v":"No"}]
[null,null,"Effective Date:",null,null,null,null,null,{"$f":"'Order Form'!SubscriptionStartDate","v":"00:00:00"}]
[]
[null,null,null,"For each of the countries you have selected, please indicate the following information:",null,null,null,null,null,null,null,null,null,null,null,null,null,null,null,null,null,null,null,null,null,null,null,null,null,null,null,null,null,null,null,null,null,null,null,null,null,null,null,null,null,null,null,null,null,null,null,null,null,null,null,null,null,null,null,null,null,null,null,null,null,null,null,null,null,null,null,null,null,null,null,null,null,null,null,null,null,null,null,null,"Export area for Reg Database",null,null,null,null,null,null,null,null,null,null,null,null,null,null,null,null,null,null,null,null,null,null,null,null,null,null,null,null,null,null,null,null,null,null,null,null,null,null,null,null,null,null,null,null,null,null,null,null,null,null,null,null,null,null,null,null,"These are working columns, will be hidden when finished with coding"]
[]
[null,null,null,"  1)  Data Submission.  Indicate Yes or No for Data Submission.  Note there is an additional fee if you do not submit your data,",null,null,null,null,null,null,null,null,null,null,null,null,null,null,null,null,null,null,null,null,null,null,null,null,null,null,null,null,null,null,null,null,null,null,null,null,null,null,null,null,null,null,null,null,null,null,null,null,null,null,null,null,null,null,null,null,null,null,null,null,"Organization Name","Account Number","Order Number","Billing Name","Billing Title","Address1","Address2","Billing State","Billing City","Billing Postal Code","Billing Country","Billing Phone","Billing E-Mail","Organization Type","Subscription Type","Subscription Start Date","Subscription End Date","Currency","Purchase Order"]
[null,null,null,"  2)  Custom Cut.  For each country, indicate if you would like to add a Custom Cut to your subscription.  No charge for the first custom cut.",null,null,null,null,null,null,null,null,null,null,null,null,null,null,null,null,null,null,null,null,null,null,null,null,null,null,null,null,null,null,null,null,null,null,null,null,null,null,null,null,null,null,null,null,null,null,null,null,null,null,null,null,null,null,null,null,null,null,null,null,{"$f":"C17","v":""},{"$f":"AccountNumber","v":0},{"$f":"I41","v":0},{"$f":"IF(AB29=\"\",Z17&\" \"&AB17&\" \"&AN17,Z29&\" \"&AB29&\" \"&AN29)","v":"  "},{"$f":"IF(C32=\"\",C20,C32)","v":""},{"$f":"IF(G35=\"\",G23,G35)","v":""},{"$f":"IF(AF35=\"\",AF23,AF35)","v":""},{"$f":"IF(O37=\"\",IF(O25=\"\",\"\", \", \"&VLOOKUP(O25,StateAbbr,2,FALSE)), \", \"&VLOOKUP(O37,StateAbbr,2,FALSE))","v":""},{"$f":"IF(G36=\"\",G24,G36)","v":""},{"$f":"IF(AS36=\"\",AS24,AS36)","v":""},{"$f":"IF(AF36=\"\",AF24,AF36)","v":""},{"$f":"IF(AB32=\"\",AB20,AB32)","v":""},{"$f":"IF(O32=\"\",O20,O32)","v":""},{"$f":"'Order Form'!L101","v":"Type of Organization"},{"$f":"ProductOption","v":"Product Option"},{"$f":"'Order Form'!L105","v":"00:00:00"},{"$f":"DATE(YEAR(CB47)+3,MONTH(CB47),DAY(CB47))-1","v":"1902-12-30"},{"$f":"Currency","v":"USD"},{"$f":"IF(ISBLANK(PurchaseOrderNo),\"\",PurchaseOrderNo)","v":""}]
[null,null,null,null,null,null,null,null,null,null,null,null,null,null,null,null,null,null,null,null,null,null,null,null,null,null,null,null,null,null,null,null,null,null,null,null,null,null,null,null,null,null,null,null,null,null,null,null,null,null,null,null,null,null,null,null,null,null,null,null,null,null,null,null,null,null,null,null,null,null,null,null,null,null,null,null,null,"Billing Year",{"$f":"IF(TODAY()>CB47+730,\"Year 3\",IF(TODAY()>CB47+365,\"Year 2\",\"Year 1\"))","v":"Year 3"}]
[null,null,null,null,null,null,null,null,null,null,null,null,null,null,null,null,null,null,null,null,null,null,null,null,null,null,null,null,null,null,null,null,null,null,null,null,null,null,null,null,null,null,null,null,null,null,null,null,null,null,null,null,null,null,null,null,null,null,null,null,null,null,null,null,"cc Emails",null,null,null,null,"Sales Rep"]
[null,null,null,"Note:  You can use copy/paste commands, or drag values down, to copy information to multiple lines.",null,null,null,null,null,null,null,null,null,null,null,null,null,null,null,null,null,null,null,null,null,null,null,null,null,null,null,null,null,null,null,null,null,null,null,null,null,null,null,null,null,null,null,null,null,null,null,null,null,null,null,null,null,null,null,null,null,null,null,null,{"$f":"ccemails","v":0},null,null,null,null,{"$f":"IF(ISBLANK(SalesRep),\"support@birchesgroup.com\",SalesRep)","v":"support@birchesgroup.com"},null,null,null,{"$f":"IF(NGOGPChoice=\"no\",\"\",\"Data:NGO Global Pay:Sustaining Partner\")","v":""},null,{"$f":"IF(NGOGPChoice=\"No\",\"\",NGOGlobalPayFee)","v":""},{"$f":"IF(M114=\"No\",\"Data:NGO Global Pay:Non-Participant Surcharge\",\"\")","v":""},null,null,{"$f":"AJ114","v":0}]
[null,null,null,null,null,null,null,null,null,null,null,null,null,null,null,null,null,null,null,null,null,null,null,null,null,null,null,null,null,null,null,null,null,null,null,null,null,null,null,null,null,null,null,null,null,null,null,null,null,null,null,null,null,null,null,null,null,null,null,null,null,null,null,null,"Tax Gross-Up",{"$f":"U127","v":0}]
[null,null,null,"Country",null,null,null,null,null,null,null,null,"Will You Submit Data (Y/N)?",null,null,null,null,{"$f":"CONCATENATE(\"     Profiles Available     (\",TEXT(NGOSP,\"$#,##0\"),\" per country)\")","v":{"$error":"#N/A"}},null,null,null,null,null,null,null,null,"Custom Cut",null,null,null,null,null,null,null,null,"Non-Participation Surcharge*\n(50% of survey fees)",null,null,null,null,null,null,null,null,null,null,null,null,null,null,null,null,null,null,null,null,null,null,null,null,null,null,null,null,null,null,null,null,null,null,null,null,null,null,null,null,null,null,null,null,null,null,null,null,"Information about the person who responded ",null,null,null,null,null,null,null,null,null,null,"Survey Data Contacts",null,null,null,null,null,null,null,null,null,null,null,null,null,null,null,null,null,"HQ/Regional Contacts",null,null,null,null,null,null,null,null,"Survey\nAccess",null,"Billing"]
[null,null,null,null,null,null,null,null,null,null,null,null,"choose",null,null,null,null,null,null,null,null,null,null,null,null,null,"choose",null,null,null,null,null,null,null,null,null,null,null,null,null,null,null,null,null,null,null,null,null,null,null,null,null,null,null,null,null,null,null,null,null,null,null,null,null,"Organization Name","Order Number","Class","Data:Multi-year Indigo Purchase:Sustaining Partner","Custom Cut Description","Data:Specialized Data:Custom Cut","SubsectorName","Data:Specialized Data:Subsector Cut","Data:General Fees:Non-Participant Fee","Group Total","Billing Period StartDate","Billing Period End Date",null,null,null,null,null,null,null,null,"Date Registered","Salutation (Mr/Ms)","First or Given Name","Last or Family Name","Name of Organization","Your Job Title","Country in which you are Located","Phone number (including country code)","Email Address","Skype Address","Number of Countries:","Country Name","Salutation (Mr/Ms)","First or Given Name","Last or Family Name","Name of Organization","Job Title","Country","Phone number (including country code)","Email Address","Skype Address - LCL","Response","EE Threshold","Next Pay Review Date","Pay Review Frequency","Survey Year","Country-Year","Survey Status","UniqueKey","Salutation (Mr/Ms)","First or Given Name","Last or Family Name","Name of Organization","Job Title","Country","Phone number (including country code)","Email Address","Skype Address - HQ","Name","E-mail Address","Send invoice to","Salutation (Mr/Ms)","First or Given Name","Last or Family Name","Name of Organization","Job Title","Country","Phone number (including country code)","Email Address","Skype Address - Billing","Notes","Response","Will provide data?","Preferred Partner?","Fee applies",null,null,"Main Product","Start Date","End Date","Pricing","Indigo™","MS Add-on","Custom Cut","Subsector (Subsector Name)","Participate"]
[null,null,1,null,null,null,null,null,null,null,null,null,null,null,null,null,null,{"$f":"IF(ISNA(VLOOKUP($D54,SurveyElections,2,FALSE)),\"\",VLOOKUP($D54,SurveyElections,2,FALSE))","v":""},null,null,null,null,null,null,null,null,null,null,null,null,null,null,null,null,null,{"$f":"IFERROR(ROUND(IF(ISBLANK(D54),\"\",IF(M54=\"Yes\",0,NGOSP*0.5)),0),\"\")","v":""},null,null,null,null,null,null,null,null,null,null,null,null,null,null,null,null,null,null,null,null,null,null,null,null,null,null,null,null,{"$f":"OrgName","v":0},{"$f":"OrderNumber","v":0},{"$f":"IF(ISBLANK(D54),\"\",D54)","v":""},{"$f":"IF(ISBLANK(D54),\"\",NGOSP)","v":""},{"$f":"IF(ISBLANK(AA54),\"\",AA54)","v":""},{"$f":"IF(AA54=\"All Cycles\",CustomAll,0)+IF(OR(AA54=\"Cycle 1 (Apr)\", AA54=\"Cycle 2 (Jul)\", AA54=\"Cycle 3 (Oct)\"),Custom,0)","v":0},null,null,{"$f":"IF(M54=\"Yes\",\"\",AJ54)","v":""},{"$f":"SUM(BU54,BP54,BR54,BT54)","v":0},{"$f":"IF($CA$48=\"Year 1\",$CB$47,IF($CA$48=\"Year 2\",EDATE($CB$47,12),EDATE($CB$47,24)))","v":"1901-12-31"},{"$f":"IF(BW54=\"\",\"\",DATE(YEAR(BW54)+1,MONTH(BW54),DAY(BW54)-1))","v":"1902-12-30"},null,null,null,null,null,null,null,null,{"$f":"TODAY()","v":"2021-03-18"},{"$f":"$Z$17","v":0},{"$f":"$AB$17","v":""},{"$f":"$AN$17","v":""},{"$f":"$C$17","v":""},{"$f":"$C$20","v":""},{"$f":"$AF$24","v":""},{"$f":"$AB$20","v":""},{"$f":"$O$20","v":""},{"$f":"$AN$20","v":""},{"$f":"TotalIndigo","v":0},{"$f":"D54","v":0},{"$f":"VLOOKUP($CR54,SurveyDataContacts,'Survey Contacts'!$L$24,FALSE)","v":{"$error":"#N/A"}},{"$f":"VLOOKUP($CR54,SurveyDataContacts,'Survey Contacts'!$T$24,FALSE)","v":{"$error":"#N/A"}},{"$f":"VLOOKUP($CR54,SurveyDataContacts,'Survey Contacts'!$AL$24,FALSE)","v":{"$error":"#N/A"}},{"$f":"CK54","v":""},{"$f":"VLOOKUP($CR54,SurveyDataContacts,'Survey Contacts'!$BD$24,FALSE)","v":{"$error":"#N/A"}},{"$f":"VLOOKUP($CR54,SurveyDataContacts,'Survey Contacts'!$DS$24,FALSE)","v":{"$error":"#N/A"}},{"$f":"VLOOKUP($CR54,SurveyDataContacts,'Survey Contacts'!$BV$24,FALSE)","v":{"$error":"#N/A"}},{"$f":"VLOOKUP($CR54,SurveyDataContacts,'Survey Contacts'!$CQ$24,FALSE)","v":{"$error":"#N/A"}},{"$f":"VLOOKUP($CR54,SurveyDataContacts,'Survey Contacts'!$DE$24,FALSE)","v":{"$error":"#N/A"}},{"$f":"VLOOKUP($CR54,Country_Information_SP,$N$155,FALSE)","v":{"$error":"#N/A"}},{"$f":"IF(DB54<16,\"15 or Less\",\"More than 15\")","v":{"$error":"#N/A"}},{"$f":"VLOOKUP($CR54,Country_Information_SP,$W$155,FALSE)","v":{"$error":"#N/A"}},{"$f":"VLOOKUP($CR54,Country_Information_SP,$AF$155,FALSE)","v":{"$error":"#N/A"}},{"$f":"YEAR($I$42)","v":1900},{"$f":"CR54&\" - \"&DF54","v":"0 - 1900"},null,{"$f":"CV54&CR54&DF54","v":"01900"},{"$f":"VLOOKUP($D54,HQ_Contacts,'HQ and Regional Contacts'!$Q$24,FALSE)","v":{"$error":"#N/A"}},{"$f":"VLOOKUP($D54,HQ_Contacts,'HQ and Regional Contacts'!$Y$24,FALSE)","v":{"$error":"#N/A"}},{"$f":"VLOOKUP($D54,HQ_Contacts,'HQ and Regional Contacts'!$AQ$24,FALSE)","v":{"$error":"#N/A"}},{"$f":"CV54","v":""},{"$f":"VLOOKUP($D54,HQ_Contacts,'HQ and Regional Contacts'!$BI$24,FALSE)","v":{"$error":"#N/A"}},{"$f":"VLOOKUP($D54,HQ_Contacts,'HQ and Regional Contacts'!$DX$24,FALSE)","v":{"$error":"#N/A"}},{"$f":"VLOOKUP($D54,HQ_Contacts,'HQ and Regional Contacts'!$CA$24,FALSE)","v":{"$error":"#N/A"}},{"$f":"VLOOKUP($D54,HQ_Contacts,'HQ and Regional Contacts'!$CV$24,FALSE)","v":{"$error":"#N/A"}},{"$f":"VLOOKUP($D54,HQ_Contacts,'HQ and Regional Contacts'!$DJ$24,FALSE)","v":{"$error":"#N/A"}},null,null,{"$f":"IF(ISBLANK(BillingSurnames),\"Same Individual\",\"Different Individual\")","v":"Same Individual"},{"$f":"$Z$29","v":""},{"$f":"$AB$29","v":""},{"$f":"$AN$29","v":""},{"$f":"$C$29","v":""},{"$f":"$C$32","v":""},{"$f":"$AF$36","v":""},{"$f":"$AB$32","v":""},{"$f":"$O$32","v":""},{"$f":"$AN$32","v":""},{"$f":"EV54","v":""},null,{"$f":"IF(D54=\"\",\"\",IF(M54=\"Yes\",\"Yes\",\"No\"))","v":""},"Yes",null,null,null,{"$f":"IF(D54=\"\",\"\",\"PP: \")","v":""},{"$f":"TEXT($I$42,\"dd-mmm-yyyy\")","v":"00-Jan-1900"},{"$f":"TEXT(EM54+364,\"dd-mmm-yyyy\")&\";\"","v":{"$error":"#VALUE!"}},{"$f":"IF('Order Form'!$L$101=\"NGO\",\"\",\" (CDO Pricing); \")","v":" (CDO Pricing); "},{"$f":"IF(#REF!=\"X\",\"Indigo Access;\",\"\")","v":{"$error":"#REF!"}},{"$f":"IF(Y54=\"X\",\"MS Add-on;\",\"\")","v":""},{"$f":"IF(AA54=\"\",\"\",\"Custom Cut (\"&AA54&\");\")","v":""},{"$f":"IF(#REF!=\"\",\"\",\"Subsector: \"&#REF!&\";\")","v":{"$error":"#REF!"}},{"$f":"IF(EG54=\"Yes\",\"\",\"No data to provide;\")","v":"No data to provide;"},null,{"$f":"IF(EL54=\"\",\"\",EL54&EM54&\" - \"&EN54&EO54&EP54&EQ54&ER54&ES54&ET54)","v":""}]
[null,null,{"$f":"C54+1","v":2},null,null,null,null,null,null,null,null,null,null,null,null,null,null,"",null,null,null,null,null,null,null,null,null,null,null,null,null,null,null,null,null,"",null,null,null,null,null,null,null,null,null,null,null,null,null,null,null,null,null,null,null,null,null,null,null,null,null,null,null,null,0,0,"","","",0,null,null,"",0,"1901-12-31",{"$f":"IF(BW55=\"\",\"\",DATE(YEAR(BW55)+1,MONTH(BW55),DAY(BW55)-1))","v":"1902-12-30"},null,null,null,null,null,null,null,null,{"$f":"TODAY()","v":"2021-03-18"},{"$f":"$Z$17","v":0},{"$f":"$AB$17","v":""},{"$f":"$AN$17","v":""},{"$f":"$C$17","v":""},{"$f":"$C$20","v":""},{"$f":"$AF$24","v":""},{"$f":"$AB$20","v":""},{"$f":"$O$20","v":""},{"$f":"$AN$20","v":""},0,0,{"$f":"VLOOKUP($CR55,SurveyDataContacts,'Survey Contacts'!$L$24,FALSE)","v":{"$error":"#N/A"}},{"$f":"VLOOKUP($CR55,SurveyDataContacts,'Survey Contacts'!$T$24,FALSE)","v":{"$error":"#N/A"}},{"$f":"VLOOKUP($CR55,SurveyDataContacts,'Survey Contacts'!$AL$24,FALSE)","v":{"$error":"#N/A"}},{"$f":"CK55","v":""},{"$f":"VLOOKUP($CR55,SurveyDataContacts,'Survey Contacts'!$BD$24,FALSE)","v":{"$error":"#N/A"}},{"$f":"VLOOKUP($CR55,SurveyDataContacts,'Survey Contacts'!$DS$24,FALSE)","v":{"$error":"#N/A"}},{"$f":"VLOOKUP($CR55,SurveyDataContacts,'Survey Contacts'!$BV$24,FALSE)","v":{"$error":"#N/A"}},{"$f":"VLOOKUP($CR55,SurveyDataContacts,'Survey Contacts'!$CQ$24,FALSE)","v":{"$error":"#N/A"}},{"$f":"VLOOKUP($CR55,SurveyDataContacts,'Survey Contacts'!$DE$24,FALSE)","v":{"$error":"#N/A"}},{"$error":"#N/A"},{"$f":"IF(DB55<16,\"15 or Less\",\"More than 15\")","v":{"$error":"#N/A"}},{"$error":"#N/A"},{"$error":"#N/A"},{"$f":"YEAR($I$42)","v":1900},{"$f":"CR55&\" - \"&DF55","v":"0 - 1900"},null,{"$f":"CV55&CR55&DF55","v":"01900"},{"$f":"VLOOKUP($D55,HQ_Contacts,'HQ and Regional Contacts'!$Q$24,FALSE)","v":{"$error":"#N/A"}},{"$f":"VLOOKUP($D55,HQ_Contacts,'HQ and Regional Contacts'!$Y$24,FALSE)","v":{"$error":"#N/A"}},{"$f":"VLOOKUP($D55,HQ_Contacts,'HQ and Regional Contacts'!$AQ$24,FALSE)","v":{"$error":"#N/A"}},{"$f":"CV55","v":""},{"$f":"VLOOKUP($D55,HQ_Contacts,'HQ and Regional Contacts'!$BI$24,FALSE)","v":{"$error":"#N/A"}},{"$f":"VLOOKUP($D55,HQ_Contacts,'HQ and Regional Contacts'!$DX$24,FALSE)","v":{"$error":"#N/A"}},{"$f":"VLOOKUP($D55,HQ_Contacts,'HQ and Regional Contacts'!$CA$24,FALSE)","v":{"$error":"#N/A"}},{"$f":"VLOOKUP($D55,HQ_Contacts,'HQ and Regional Contacts'!$CV$24,FALSE)","v":{"$error":"#N/A"}},{"$f":"VLOOKUP($D55,HQ_Contacts,'HQ and Regional Contacts'!$DJ$24,FALSE)","v":{"$error":"#N/A"}},null,null,"Same Individual",{"$f":"$Z$29","v":""},{"$f":"$AB$29","v":""},{"$f":"$AN$29","v":""},{"$f":"$C$29","v":""},{"$f":"$C$32","v":""},{"$f":"$AF$36","v":""},{"$f":"$AB$32","v":""},{"$f":"$O$32","v":""},{"$f":"$AN$32","v":""},{"$f":"EV55","v":""},null,"","Yes",null,null,null,"",{"$f":"TEXT($I$42,\"dd-mmm-yyyy\")","v":"00-Jan-1900"},{"$f":"TEXT(EM55+364,\"dd-mmm-yyyy\")&\";\"","v":{"$error":"#VALUE!"}},{"$f":"IF('Order Form'!$L$101=\"NGO\",\"\",\" (CDO Pricing); \")","v":" (CDO Pricing); "},{"$f":"IF(#REF!=\"X\",\"Indigo Access;\",\"\")","v":{"$error":"#REF!"}},"","",{"$f":"IF(#REF!=\"\",\"\",\"Subsector: \"&#REF!&\";\")","v":{"$error":"#REF!"}},{"$f":"IF(EG55=\"Yes\",\"\",\"No data to provide;\")","v":"No data to provide;"},null,{"$f":"IF(EL55=\"\",\"\",EL55&EM55&\" - \"&EN55&EO55&EP55&EQ55&ER55&ES55&ET55)","v":""}]
[null,null,{"$f":"C55+1","v":3},null,null,null,null,null,null,null,null,null,null,null,null,null,null,"",null,null,null,null,null,null,null,null,null,null,null,null,null,null,null,null,null,"",null,null,null,null,null,null,null,null,null,null,null,null,null,null,null,null,null,null,null,null,null,null,null,null,null,null,null,null,0,0,"","","",0,null,null,"",0,"1901-12-31","1902-12-30",null,null,null,null,null,null,null,null,"2021-03-18",0,"","","","","","","","",0,0,{"$f":"VLOOKUP($CR56,SurveyDataContacts,'Survey Contacts'!$L$24,FALSE)","v":{"$error":"#N/A"}},{"$f":"VLOOKUP($CR56,SurveyDataContacts,'Survey Contacts'!$T$24,FALSE)","v":{"$error":"#N/A"}},{"$f":"VLOOKUP($CR56,SurveyDataContacts,'Survey Contacts'!$AL$24,FALSE)","v":{"$error":"#N/A"}},"",{"$f":"VLOOKUP($CR56,SurveyDataContacts,'Survey Contacts'!$BD$24,FALSE)","v":{"$error":"#N/A"}},{"$f":"VLOOKUP($CR56,SurveyDataContacts,'Survey Contacts'!$DS$24,FALSE)","v":{"$error":"#N/A"}},{"$f":"VLOOKUP($CR56,SurveyDataContacts,'Survey Contacts'!$BV$24,FALSE)","v":{"$error":"#N/A"}},{"$f":"VLOOKUP($CR56,SurveyDataContacts,'Survey Contacts'!$CQ$24,FALSE)","v":{"$error":"#N/A"}},{"$f":"VLOOKUP($CR56,SurveyDataContacts,'Survey Contacts'!$DE$24,FALSE)","v":{"$error":"#N/A"}},{"$error":"#N/A"},{"$error":"#N/A"},{"$error":"#N/A"},{"$error":"#N/A"},1900,"0 - 1900",null,"01900",{"$f":"VLOOKUP($D56,HQ_Contacts,'HQ and Regional Contacts'!$Q$24,FALSE)","v":{"$error":"#N/A"}},{"$f":"VLOOKUP($D56,HQ_Contacts,'HQ and Regional Contacts'!$Y$24,FALSE)","v":{"$error":"#N/A"}},{"$f":"VLOOKUP($D56,HQ_Contacts,'HQ and Regional Contacts'!$AQ$24,FALSE)","v":{"$error":"#N/A"}},"",{"$f":"VLOOKUP($D56,HQ_Contacts,'HQ and Regional Contacts'!$BI$24,FALSE)","v":{"$error":"#N/A"}},{"$f":"VLOOKUP($D56,HQ_Contacts,'HQ and Regional Contacts'!$DX$24,FALSE)","v":{"$error":"#N/A"}},{"$f":"VLOOKUP($D56,HQ_Contacts,'HQ and Regional Contacts'!$CA$24,FALSE)","v":{"$error":"#N/A"}},{"$f":"VLOOKUP($D56,HQ_Contacts,'HQ and Regional Contacts'!$CV$24,FALSE)","v":{"$error":"#N/A"}},{"$f":"VLOOKUP($D56,HQ_Contacts,'HQ and Regional Contacts'!$DJ$24,FALSE)","v":{"$error":"#N/A"}},null,null,"Same Individual","","","","","","","","","","",null,"","Yes",null,null,null,"","00-Jan-1900",{"$error":"#VALUE!"},{"$f":"IF('Order Form'!$L$101=\"NGO\",\"\",\" (CDO Pricing); \")","v":" (CDO Pricing); "},{"$f":"IF(#REF!=\"X\",\"Indigo Access;\",\"\")","v":{"$error":"#REF!"}},"","",{"$f":"IF(#REF!=\"\",\"\",\"Subsector: \"&#REF!&\";\")","v":{"$error":"#REF!"}},"No data to provide;",null,""]
[null,null,4,null,null,null,null,null,null,null,null,null,null,null,null,null,null,"",null,null,null,null,null,null,null,null,null,null,null,null,null,null,null,null,null,"",null,null,null,null,null,null,null,null,null,null,null,null,null,null,null,null,null,null,null,null,null,null,null,null,null,null,null,null,0,0,"","","",0,null,null,"",0,"1901-12-31","1902-12-30",null,null,null,null,null,null,null,null,"2021-03-18",0,"","","","","","","","",0,0,{"$f":"VLOOKUP($CR57,SurveyDataContacts,'Survey Contacts'!$L$24,FALSE)","v":{"$error":"#N/A"}},{"$f":"VLOOKUP($CR57,SurveyDataContacts,'Survey Contacts'!$T$24,FALSE)","v":{"$error":"#N/A"}},{"$f":"VLOOKUP($CR57,SurveyDataContacts,'Survey Contacts'!$AL$24,FALSE)","v":{"$error":"#N/A"}},"",{"$f":"VLOOKUP($CR57,SurveyDataContacts,'Survey Contacts'!$BD$24,FALSE)","v":{"$error":"#N/A"}},{"$f":"VLOOKUP($CR57,SurveyDataContacts,'Survey Contacts'!$DS$24,FALSE)","v":{"$error":"#N/A"}},{"$f":"VLOOKUP($CR57,SurveyDataContacts,'Survey Contacts'!$BV$24,FALSE)","v":{"$error":"#N/A"}},{"$f":"VLOOKUP($CR57,SurveyDataContacts,'Survey Contacts'!$CQ$24,FALSE)","v":{"$error":"#N/A"}},{"$f":"VLOOKUP($CR57,SurveyDataContacts,'Survey Contacts'!$DE$24,FALSE)","v":{"$error":"#N/A"}},{"$error":"#N/A"},{"$error":"#N/A"},{"$error":"#N/A"},{"$error":"#N/A"},1900,"0 - 1900",null,"01900",{"$f":"VLOOKUP($D57,HQ_Contacts,'HQ and Regional Contacts'!$Q$24,FALSE)","v":{"$error":"#N/A"}},{"$f":"VLOOKUP($D57,HQ_Contacts,'HQ and Regional Contacts'!$Y$24,FALSE)","v":{"$error":"#N/A"}},{"$f":"VLOOKUP($D57,HQ_Contacts,'HQ and Regional Contacts'!$AQ$24,FALSE)","v":{"$error":"#N/A"}},"",{"$f":"VLOOKUP($D57,HQ_Contacts,'HQ and Regional Contacts'!$BI$24,FALSE)","v":{"$error":"#N/A"}},{"$f":"VLOOKUP($D57,HQ_Contacts,'HQ and Regional Contacts'!$DX$24,FALSE)","v":{"$error":"#N/A"}},{"$f":"VLOOKUP($D57,HQ_Contacts,'HQ and Regional Contacts'!$CA$24,FALSE)","v":{"$error":"#N/A"}},{"$f":"VLOOKUP($D57,HQ_Contacts,'HQ and Regional Contacts'!$CV$24,FALSE)","v":{"$error":"#N/A"}},{"$f":"VLOOKUP($D57,HQ_Contacts,'HQ and Regional Contacts'!$DJ$24,FALSE)","v":{"$error":"#N/A"}},null,null,"Same Individual","","","","","","","","","","",null,"","Yes",null,null,null,"","00-Jan-1900",{"$error":"#VALUE!"},{"$f":"IF('Order Form'!$L$101=\"NGO\",\"\",\" (CDO Pricing); \")","v":" (CDO Pricing); "},{"$f":"IF(#REF!=\"X\",\"Indigo Access;\",\"\")","v":{"$error":"#REF!"}},"","",{"$f":"IF(#REF!=\"\",\"\",\"Subsector: \"&#REF!&\";\")","v":{"$error":"#REF!"}},"No data to provide;",null,""]
[null,null,5,null,null,null,null,null,null,null,null,null,null,null,null,null,null,"",null,null,null,null,null,null,null,null,null,null,null,null,null,null,null,null,null,"",null,null,null,null,null,null,null,null,null,null,null,null,null,null,null,null,null,null,null,null,null,null,null,null,null,null,null,null,0,0,"","","",0,null,null,"",0,"1901-12-31","1902-12-30",null,null,null,null,null,null,null,null,"2021-03-18",0,"","","","","","","","",0,0,{"$f":"VLOOKUP($CR58,SurveyDataContacts,'Survey Contacts'!$L$24,FALSE)","v":{"$error":"#N/A"}},{"$f":"VLOOKUP($CR58,SurveyDataContacts,'Survey Contacts'!$T$24,FALSE)","v":{"$error":"#N/A"}},{"$f":"VLOOKUP($CR58,SurveyDataContacts,'Survey Contacts'!$AL$24,FALSE)","v":{"$error":"#N/A"}},"",{"$f":"VLOOKUP($CR58,SurveyDataContacts,'Survey Contacts'!$BD$24,FALSE)","v":{"$error":"#N/A"}},{"$f":"VLOOKUP($CR58,SurveyDataContacts,'Survey Contacts'!$DS$24,FALSE)","v":{"$error":"#N/A"}},{"$f":"VLOOKUP($CR58,SurveyDataContacts,'Survey Contacts'!$BV$24,FALSE)","v":{"$error":"#N/A"}},{"$f":"VLOOKUP($CR58,SurveyDataContacts,'Survey Contacts'!$CQ$24,FALSE)","v":{"$error":"#N/A"}},{"$f":"VLOOKUP($CR58,SurveyDataContacts,'Survey Contacts'!$DE$24,FALSE)","v":{"$error":"#N/A"}},{"$error":"#N/A"},{"$error":"#N/A"},{"$error":"#N/A"},{"$error":"#N/A"},1900,"0 - 1900",null,"01900",{"$f":"VLOOKUP($D58,HQ_Contacts,'HQ and Regional Contacts'!$Q$24,FALSE)","v":{"$error":"#N/A"}},{"$f":"VLOOKUP($D58,HQ_Contacts,'HQ and Regional Contacts'!$Y$24,FALSE)","v":{"$error":"#N/A"}},{"$f":"VLOOKUP($D58,HQ_Contacts,'HQ and Regional Contacts'!$AQ$24,FALSE)","v":{"$error":"#N/A"}},"",{"$f":"VLOOKUP($D58,HQ_Contacts,'HQ and Regional Contacts'!$BI$24,FALSE)","v":{"$error":"#N/A"}},{"$f":"VLOOKUP($D58,HQ_Contacts,'HQ and Regional Contacts'!$DX$24,FALSE)","v":{"$error":"#N/A"}},{"$f":"VLOOKUP($D58,HQ_Contacts,'HQ and Regional Contacts'!$CA$24,FALSE)","v":{"$error":"#N/A"}},{"$f":"VLOOKUP($D58,HQ_Contacts,'HQ and Regional Contacts'!$CV$24,FALSE)","v":{"$error":"#N/A"}},{"$f":"VLOOKUP($D58,HQ_Contacts,'HQ and Regional Contacts'!$DJ$24,FALSE)","v":{"$error":"#N/A"}},null,null,"Same Individual","","","","","","","","","","",null,"","Yes",null,null,null,"","00-Jan-1900",{"$error":"#VALUE!"},{"$f":"IF('Order Form'!$L$101=\"NGO\",\"\",\" (CDO Pricing); \")","v":" (CDO Pricing); "},{"$f":"IF(#REF!=\"X\",\"Indigo Access;\",\"\")","v":{"$error":"#REF!"}},"","",{"$f":"IF(#REF!=\"\",\"\",\"Subsector: \"&#REF!&\";\")","v":{"$error":"#REF!"}},"No data to provide;",null,""]
[null,null,6,null,null,null,null,null,null,null,null,null,null,null,null,null,null,"",null,null,null,null,null,null,null,null,null,null,null,null,null,null,null,null,null,"",null,null,null,null,null,null,null,null,null,null,null,null,null,null,null,null,null,null,null,null,null,null,null,null,null,null,null,null,0,0,"","","",0,null,null,"",0,"1901-12-31","1902-12-30",null,null,null,null,null,null,null,null,"2021-03-18",0,"","","","","","","","",0,0,{"$f":"VLOOKUP($CR59,SurveyDataContacts,'Survey Contacts'!$L$24,FALSE)","v":{"$error":"#N/A"}},{"$f":"VLOOKUP($CR59,SurveyDataContacts,'Survey Contacts'!$T$24,FALSE)","v":{"$error":"#N/A"}},{"$f":"VLOOKUP($CR59,SurveyDataContacts,'Survey Contacts'!$AL$24,FALSE)","v":{"$error":"#N/A"}},"",{"$f":"VLOOKUP($CR59,SurveyDataContacts,'Survey Contacts'!$BD$24,FALSE)","v":{"$error":"#N/A"}},{"$f":"VLOOKUP($CR59,SurveyDataContacts,'Survey Contacts'!$DS$24,FALSE)","v":{"$error":"#N/A"}},{"$f":"VLOOKUP($CR59,SurveyDataContacts,'Survey Contacts'!$BV$24,FALSE)","v":{"$error":"#N/A"}},{"$f":"VLOOKUP($CR59,SurveyDataContacts,'Survey Contacts'!$CQ$24,FALSE)","v":{"$error":"#N/A"}},{"$f":"VLOOKUP($CR59,SurveyDataContacts,'Survey Contacts'!$DE$24,FALSE)","v":{"$error":"#N/A"}},{"$error":"#N/A"},{"$error":"#N/A"},{"$error":"#N/A"},{"$error":"#N/A"},1900,{"$f":"CR59&\" - \"&DF59","v":"0 - 1900"},null,{"$f":"CV59&CR59&DF59","v":"01900"},{"$f":"VLOOKUP($D59,HQ_Contacts,'HQ and Regional Contacts'!$Q$24,FALSE)","v":{"$error":"#N/A"}},{"$f":"VLOOKUP($D59,HQ_Contacts,'HQ and Regional Contacts'!$Y$24,FALSE)","v":{"$error":"#N/A"}},{"$f":"VLOOKUP($D59,HQ_Contacts,'HQ and Regional Contacts'!$AQ$24,FALSE)","v":{"$error":"#N/A"}},{"$f":"CV59","v":""},{"$f":"VLOOKUP($D59,HQ_Contacts,'HQ and Regional Contacts'!$BI$24,FALSE)","v":{"$error":"#N/A"}},{"$f":"VLOOKUP($D59,HQ_Contacts,'HQ and Regional Contacts'!$DX$24,FALSE)","v":{"$error":"#N/A"}},{"$f":"VLOOKUP($D59,HQ_Contacts,'HQ and Regional Contacts'!$CA$24,FALSE)","v":{"$error":"#N/A"}},{"$f":"VLOOKUP($D59,HQ_Contacts,'HQ and Regional Contacts'!$CV$24,FALSE)","v":{"$error":"#N/A"}},{"$f":"VLOOKUP($D59,HQ_Contacts,'HQ and Regional Contacts'!$DJ$24,FALSE)","v":{"$error":"#N/A"}},null,null,"Same Individual","","","","","","","","","",{"$f":"EV59","v":""},null,"","Yes",null,null,null,"","00-Jan-1900",{"$error":"#VALUE!"},{"$f":"IF('Order Form'!$L$101=\"NGO\",\"\",\" (CDO Pricing); \")","v":" (CDO Pricing); "},{"$f":"IF(#REF!=\"X\",\"Indigo Access;\",\"\")","v":{"$error":"#REF!"}},"","",{"$f":"IF(#REF!=\"\",\"\",\"Subsector: \"&#REF!&\";\")","v":{"$error":"#REF!"}},"No data to provide;",null,""]
[null,null,7,null,null,null,null,null,null,null,null,null,null,null,null,null,null,"",null,null,null,null,null,null,null,null,null,null,null,null,null,null,null,null,null,"",null,null,null,null,null,null,null,null,null,null,null,null,null,null,null,null,null,null,null,null,null,null,null,null,null,null,null,null,0,0,"","","",0,null,null,"",0,"1901-12-31","1902-12-30",null,null,null,null,null,null,null,null,"2021-03-18",0,"","","","","","","","",0,0,{"$f":"VLOOKUP($CR60,SurveyDataContacts,'Survey Contacts'!$L$24,FALSE)","v":{"$error":"#N/A"}},{"$f":"VLOOKUP($CR60,SurveyDataContacts,'Survey Contacts'!$T$24,FALSE)","v":{"$error":"#N/A"}},{"$f":"VLOOKUP($CR60,SurveyDataContacts,'Survey Contacts'!$AL$24,FALSE)","v":{"$error":"#N/A"}},"",{"$f":"VLOOKUP($CR60,SurveyDataContacts,'Survey Contacts'!$BD$24,FALSE)","v":{"$error":"#N/A"}},{"$f":"VLOOKUP($CR60,SurveyDataContacts,'Survey Contacts'!$DS$24,FALSE)","v":{"$error":"#N/A"}},{"$f":"VLOOKUP($CR60,SurveyDataContacts,'Survey Contacts'!$BV$24,FALSE)","v":{"$error":"#N/A"}},{"$f":"VLOOKUP($CR60,SurveyDataContacts,'Survey Contacts'!$CQ$24,FALSE)","v":{"$error":"#N/A"}},{"$f":"VLOOKUP($CR60,SurveyDataContacts,'Survey Contacts'!$DE$24,FALSE)","v":{"$error":"#N/A"}},{"$error":"#N/A"},{"$error":"#N/A"},{"$error":"#N/A"},{"$error":"#N/A"},1900,"0 - 1900",null,"01900",{"$f":"VLOOKUP($D60,HQ_Contacts,'HQ and Regional Contacts'!$Q$24,FALSE)","v":{"$error":"#N/A"}},{"$f":"VLOOKUP($D60,HQ_Contacts,'HQ and Regional Contacts'!$Y$24,FALSE)","v":{"$error":"#N/A"}},{"$f":"VLOOKUP($D60,HQ_Contacts,'HQ and Regional Contacts'!$AQ$24,FALSE)","v":{"$error":"#N/A"}},"",{"$f":"VLOOKUP($D60,HQ_Contacts,'HQ and Regional Contacts'!$BI$24,FALSE)","v":{"$error":"#N/A"}},{"$f":"VLOOKUP($D60,HQ_Contacts,'HQ and Regional Contacts'!$DX$24,FALSE)","v":{"$error":"#N/A"}},{"$f":"VLOOKUP($D60,HQ_Contacts,'HQ and Regional Contacts'!$CA$24,FALSE)","v":{"$error":"#N/A"}},{"$f":"VLOOKUP($D60,HQ_Contacts,'HQ and Regional Contacts'!$CV$24,FALSE)","v":{"$error":"#N/A"}},{"$f":"VLOOKUP($D60,HQ_Contacts,'HQ and Regional Contacts'!$DJ$24,FALSE)","v":{"$error":"#N/A"}},null,null,"Same Individual","","","","","","","","","","",null,"","Yes",null,null,null,"","00-Jan-1900",{"$error":"#VALUE!"},{"$f":"IF('Order Form'!$L$101=\"NGO\",\"\",\" (CDO Pricing); \")","v":" (CDO Pricing); "},{"$f":"IF(#REF!=\"X\",\"Indigo Access;\",\"\")","v":{"$error":"#REF!"}},"","",{"$f":"IF(#REF!=\"\",\"\",\"Subsector: \"&#REF!&\";\")","v":{"$error":"#REF!"}},"No data to provide;",null,""]
[null,null,8,null,null,null,null,null,null,null,null,null,null,null,null,null,null,"",null,null,null,null,null,null,null,null,null,null,null,null,null,null,null,null,null,"",null,null,null,null,null,null,null,null,null,null,null,null,null,null,null,null,null,null,null,null,null,null,null,null,null,null,null,null,0,0,"","","",0,null,null,"",0,"1901-12-31","1902-12-30",null,null,null,null,null,null,null,null,"2021-03-18",0,"","","","","","","","",0,0,{"$f":"VLOOKUP($CR61,SurveyDataContacts,'Survey Contacts'!$L$24,FALSE)","v":{"$error":"#N/A"}},{"$f":"VLOOKUP($CR61,SurveyDataContacts,'Survey Contacts'!$T$24,FALSE)","v":{"$error":"#N/A"}},{"$f":"VLOOKUP($CR61,SurveyDataContacts,'Survey Contacts'!$AL$24,FALSE)","v":{"$error":"#N/A"}},"",{"$f":"VLOOKUP($CR61,SurveyDataContacts,'Survey Contacts'!$BD$24,FALSE)","v":{"$error":"#N/A"}},{"$f":"VLOOKUP($CR61,SurveyDataContacts,'Survey Contacts'!$DS$24,FALSE)","v":{"$error":"#N/A"}},{"$f":"VLOOKUP($CR61,SurveyDataContacts,'Survey Contacts'!$BV$24,FALSE)","v":{"$error":"#N/A"}},{"$f":"VLOOKUP($CR61,SurveyDataContacts,'Survey Contacts'!$CQ$24,FALSE)","v":{"$error":"#N/A"}},{"$f":"VLOOKUP($CR61,SurveyDataContacts,'Survey Contacts'!$DE$24,FALSE)","v":{"$error":"#N/A"}},{"$error":"#N/A"},{"$error":"#N/A"},{"$error":"#N/A"},{"$error":"#N/A"},1900,"0 - 1900",null,"01900",{"$f":"VLOOKUP($D61,HQ_Contacts,'HQ and Regional Contacts'!$Q$24,FALSE)","v":{"$error":"#N/A"}},{"$f":"VLOOKUP($D61,HQ_Contacts,'HQ and Regional Contacts'!$Y$24,FALSE)","v":{"$error":"#N/A"}},{"$f":"VLOOKUP($D61,HQ_Contacts,'HQ and Regional Contacts'!$AQ$24,FALSE)","v":{"$error":"#N/A"}},"",{"$f":"VLOOKUP($D61,HQ_Contacts,'HQ and Regional Contacts'!$BI$24,FALSE)","v":{"$error":"#N/A"}},{"$f":"VLOOKUP($D61,HQ_Contacts,'HQ and Regional Contacts'!$DX$24,FALSE)","v":{"$error":"#N/A"}},{"$f":"VLOOKUP($D61,HQ_Contacts,'HQ and Regional Contacts'!$CA$24,FALSE)","v":{"$error":"#N/A"}},{"$f":"VLOOKUP($D61,HQ_Contacts,'HQ and Regional Contacts'!$CV$24,FALSE)","v":{"$error":"#N/A"}},{"$f":"VLOOKUP($D61,HQ_Contacts,'HQ and Regional Contacts'!$DJ$24,FALSE)","v":{"$error":"#N/A"}},null,null,"Same Individual","","","","","","","","","","",null,"","Yes",null,null,null,"","00-Jan-1900",{"$error":"#VALUE!"},{"$f":"IF('Order Form'!$L$101=\"NGO\",\"\",\" (CDO Pricing); \")","v":" (CDO Pricing); "},{"$f":"IF(#REF!=\"X\",\"Indigo Access;\",\"\")","v":{"$error":"#REF!"}},"","",{"$f":"IF(#REF!=\"\",\"\",\"Subsector: \"&#REF!&\";\")","v":{"$error":"#REF!"}},"No data to provide;",null,""]
[null,null,9,null,null,null,null,null,null,null,null,null,null,null,null,null,null,"",null,null,null,null,null,null,null,null,null,null,null,null,null,null,null,null,null,"",null,null,null,null,null,null,null,null,null,null,null,null,null,null,null,null,null,null,null,null,null,null,null,null,null,null,null,null,0,0,"","","",0,null,null,"",0,"1901-12-31","1902-12-30",null,null,null,null,null,null,null,null,"2021-03-18",0,"","","","","","","","",0,0,{"$f":"VLOOKUP($CR62,SurveyDataContacts,'Survey Contacts'!$L$24,FALSE)","v":{"$error":"#N/A"}},{"$f":"VLOOKUP($CR62,SurveyDataContacts,'Survey Contacts'!$T$24,FALSE)","v":{"$error":"#N/A"}},{"$f":"VLOOKUP($CR62,SurveyDataContacts,'Survey Contacts'!$AL$24,FALSE)","v":{"$error":"#N/A"}},"",{"$f":"VLOOKUP($CR62,SurveyDataContacts,'Survey Contacts'!$BD$24,FALSE)","v":{"$error":"#N/A"}},{"$f":"VLOOKUP($CR62,SurveyDataContacts,'Survey Contacts'!$DS$24,FALSE)","v":{"$error":"#N/A"}},{"$f":"VLOOKUP($CR62,SurveyDataContacts,'Survey Contacts'!$BV$24,FALSE)","v":{"$error":"#N/A"}},{"$f":"VLOOKUP($CR62,SurveyDataContacts,'Survey Contacts'!$CQ$24,FALSE)","v":{"$error":"#N/A"}},{"$f":"VLOOKUP($CR62,SurveyDataContacts,'Survey Contacts'!$DE$24,FALSE)","v":{"$error":"#N/A"}},{"$error":"#N/A"},{"$error":"#N/A"},{"$error":"#N/A"},{"$error":"#N/A"},1900,"0 - 1900",null,"01900",{"$f":"VLOOKUP($D62,HQ_Contacts,'HQ and Regional Contacts'!$Q$24,FALSE)","v":{"$error":"#N/A"}},{"$f":"VLOOKUP($D62,HQ_Contacts,'HQ and Regional Contacts'!$Y$24,FALSE)","v":{"$error":"#N/A"}},{"$f":"VLOOKUP($D62,HQ_Contacts,'HQ and Regional Contacts'!$AQ$24,FALSE)","v":{"$error":"#N/A"}},"",{"$f":"VLOOKUP($D62,HQ_Contacts,'HQ and Regional Contacts'!$BI$24,FALSE)","v":{"$error":"#N/A"}},{"$f":"VLOOKUP($D62,HQ_Contacts,'HQ and Regional Contacts'!$DX$24,FALSE)","v":{"$error":"#N/A"}},{"$f":"VLOOKUP($D62,HQ_Contacts,'HQ and Regional Contacts'!$CA$24,FALSE)","v":{"$error":"#N/A"}},{"$f":"VLOOKUP($D62,HQ_Contacts,'HQ and Regional Contacts'!$CV$24,FALSE)","v":{"$error":"#N/A"}},{"$f":"VLOOKUP($D62,HQ_Contacts,'HQ and Regional Contacts'!$DJ$24,FALSE)","v":{"$error":"#N/A"}},null,null,"Same Individual","","","","","","","","","","",null,"","Yes",null,null,null,"","00-Jan-1900",{"$error":"#VALUE!"},{"$f":"IF('Order Form'!$L$101=\"NGO\",\"\",\" (CDO Pricing); \")","v":" (CDO Pricing); "},{"$f":"IF(#REF!=\"X\",\"Indigo Access;\",\"\")","v":{"$error":"#REF!"}},"","",{"$f":"IF(#REF!=\"\",\"\",\"Subsector: \"&#REF!&\";\")","v":{"$error":"#REF!"}},"No data to provide;",null,""]
[null,null,10,null,null,null,null,null,null,null,null,null,null,null,null,null,null,"",null,null,null,null,null,null,null,null,null,null,null,null,null,null,null,null,null,"",null,null,null,null,null,null,null,null,null,null,null,null,null,null,null,null,null,null,null,null,null,null,null,null,null,null,null,null,0,0,"","","",0,null,null,"",0,"1901-12-31","1902-12-30",null,null,null,null,null,null,null,null,"2021-03-18",0,"","","","","","","","",0,0,{"$f":"VLOOKUP($CR63,SurveyDataContacts,'Survey Contacts'!$L$24,FALSE)","v":{"$error":"#N/A"}},{"$f":"VLOOKUP($CR63,SurveyDataContacts,'Survey Contacts'!$T$24,FALSE)","v":{"$error":"#N/A"}},{"$f":"VLOOKUP($CR63,SurveyDataContacts,'Survey Contacts'!$AL$24,FALSE)","v":{"$error":"#N/A"}},"",{"$f":"VLOOKUP($CR63,SurveyDataContacts,'Survey Contacts'!$BD$24,FALSE)","v":{"$error":"#N/A"}},{"$f":"VLOOKUP($CR63,SurveyDataContacts,'Survey Contacts'!$DS$24,FALSE)","v":{"$error":"#N/A"}},{"$f":"VLOOKUP($CR63,SurveyDataContacts,'Survey Contacts'!$BV$24,FALSE)","v":{"$error":"#N/A"}},{"$f":"VLOOKUP($CR63,SurveyDataContacts,'Survey Contacts'!$CQ$24,FALSE)","v":{"$error":"#N/A"}},{"$f":"VLOOKUP($CR63,SurveyDataContacts,'Survey Contacts'!$DE$24,FALSE)","v":{"$error":"#N/A"}},{"$error":"#N/A"},{"$error":"#N/A"},{"$error":"#N/A"},{"$error":"#N/A"},1900,"0 - 1900",null,"01900",{"$f":"VLOOKUP($D63,HQ_Contacts,'HQ and Regional Contacts'!$Q$24,FALSE)","v":{"$error":"#N/A"}},{"$f":"VLOOKUP($D63,HQ_Contacts,'HQ and Regional Contacts'!$Y$24,FALSE)","v":{"$error":"#N/A"}},{"$f":"VLOOKUP($D63,HQ_Contacts,'HQ and Regional Contacts'!$AQ$24,FALSE)","v":{"$error":"#N/A"}},"",{"$f":"VLOOKUP($D63,HQ_Contacts,'HQ and Regional Contacts'!$BI$24,FALSE)","v":{"$error":"#N/A"}},{"$f":"VLOOKUP($D63,HQ_Contacts,'HQ and Regional Contacts'!$DX$24,FALSE)","v":{"$error":"#N/A"}},{"$f":"VLOOKUP($D63,HQ_Contacts,'HQ and Regional Contacts'!$CA$24,FALSE)","v":{"$error":"#N/A"}},{"$f":"VLOOKUP($D63,HQ_Contacts,'HQ and Regional Contacts'!$CV$24,FALSE)","v":{"$error":"#N/A"}},{"$f":"VLOOKUP($D63,HQ_Contacts,'HQ and Regional Contacts'!$DJ$24,FALSE)","v":{"$error":"#N/A"}},null,null,"Same Individual","","","","","","","","","","",null,"","Yes",null,null,null,"","00-Jan-1900",{"$error":"#VALUE!"},{"$f":"IF('Order Form'!$L$101=\"NGO\",\"\",\" (CDO Pricing); \")","v":" (CDO Pricing); "},{"$f":"IF(#REF!=\"X\",\"Indigo Access;\",\"\")","v":{"$error":"#REF!"}},"","",{"$f":"IF(#REF!=\"\",\"\",\"Subsector: \"&#REF!&\";\")","v":{"$error":"#REF!"}},"No data to provide;",null,""]
[null,null,11,null,null,null,null,null,null,null,null,null,null,null,null,null,null,"",null,null,null,null,null,null,null,null,null,null,null,null,null,null,null,null,null,"",null,null,null,null,null,null,null,null,null,null,null,null,null,null,null,null,null,null,null,null,null,null,null,null,null,null,null,null,0,0,"","","",0,null,null,"",0,"1901-12-31","1902-12-30",null,null,null,null,null,null,null,null,"2021-03-18",0,"","","","","","","","",0,0,{"$f":"VLOOKUP($CR64,SurveyDataContacts,'Survey Contacts'!$L$24,FALSE)","v":{"$error":"#N/A"}},{"$f":"VLOOKUP($CR64,SurveyDataContacts,'Survey Contacts'!$T$24,FALSE)","v":{"$error":"#N/A"}},{"$f":"VLOOKUP($CR64,SurveyDataContacts,'Survey Contacts'!$AL$24,FALSE)","v":{"$error":"#N/A"}},"",{"$f":"VLOOKUP($CR64,SurveyDataContacts,'Survey Contacts'!$BD$24,FALSE)","v":{"$error":"#N/A"}},{"$f":"VLOOKUP($CR64,SurveyDataContacts,'Survey Contacts'!$DS$24,FALSE)","v":{"$error":"#N/A"}},{"$f":"VLOOKUP($CR64,SurveyDataContacts,'Survey Contacts'!$BV$24,FALSE)","v":{"$error":"#N/A"}},{"$f":"VLOOKUP($CR64,SurveyDataContacts,'Survey Contacts'!$CQ$24,FALSE)","v":{"$error":"#N/A"}},{"$f":"VLOOKUP($CR64,SurveyDataContacts,'Survey Contacts'!$DE$24,FALSE)","v":{"$error":"#N/A"}},{"$error":"#N/A"},{"$error":"#N/A"},{"$error":"#N/A"},{"$error":"#N/A"},1900,"0 - 1900",null,"01900",{"$f":"VLOOKUP($D64,HQ_Contacts,'HQ and Regional Contacts'!$Q$24,FALSE)","v":{"$error":"#N/A"}},{"$f":"VLOOKUP($D64,HQ_Contacts,'HQ and Regional Contacts'!$Y$24,FALSE)","v":{"$error":"#N/A"}},{"$f":"VLOOKUP($D64,HQ_Contacts,'HQ and Regional Contacts'!$AQ$24,FALSE)","v":{"$error":"#N/A"}},"",{"$f":"VLOOKUP($D64,HQ_Contacts,'HQ and Regional Contacts'!$BI$24,FALSE)","v":{"$error":"#N/A"}},{"$f":"VLOOKUP($D64,HQ_Contacts,'HQ and Regional Contacts'!$DX$24,FALSE)","v":{"$error":"#N/A"}},{"$f":"VLOOKUP($D64,HQ_Contacts,'HQ and Regional Contacts'!$CA$24,FALSE)","v":{"$error":"#N/A"}},{"$f":"VLOOKUP($D64,HQ_Contacts,'HQ and Regional Contacts'!$CV$24,FALSE)","v":{"$error":"#N/A"}},{"$f":"VLOOKUP($D64,HQ_Contacts,'HQ and Regional Contacts'!$DJ$24,FALSE)","v":{"$error":"#N/A"}},null,null,"Same Individual","","","","","","","","","","",null,"","Yes",null,null,null,"","00-Jan-1900",{"$error":"#VALUE!"},{"$f":"IF('Order Form'!$L$101=\"NGO\",\"\",\" (CDO Pricing); \")","v":" (CDO Pricing); "},{"$f":"IF(#REF!=\"X\",\"Indigo Access;\",\"\")","v":{"$error":"#REF!"}},"","",{"$f":"IF(#REF!=\"\",\"\",\"Subsector: \"&#REF!&\";\")","v":{"$error":"#REF!"}},"No data to provide;",null,""]
[null,null,12,null,null,null,null,null,null,null,null,null,null,null,null,null,null,"",null,null,null,null,null,null,null,null,null,null,null,null,null,null,null,null,null,"",null,null,null,null,null,null,null,null,null,null,null,null,null,null,null,null,null,null,null,null,null,null,null,null,null,null,null,null,0,0,"","","",0,null,null,"",0,"1901-12-31","1902-12-30",null,null,null,null,null,null,null,null,"2021-03-18",0,"","","","","","","","",0,0,{"$f":"VLOOKUP($CR65,SurveyDataContacts,'Survey Contacts'!$L$24,FALSE)","v":{"$error":"#N/A"}},{"$f":"VLOOKUP($CR65,SurveyDataContacts,'Survey Contacts'!$T$24,FALSE)","v":{"$error":"#N/A"}},{"$f":"VLOOKUP($CR65,SurveyDataContacts,'Survey Contacts'!$AL$24,FALSE)","v":{"$error":"#N/A"}},"",{"$f":"VLOOKUP($CR65,SurveyDataContacts,'Survey Contacts'!$BD$24,FALSE)","v":{"$error":"#N/A"}},{"$f":"VLOOKUP($CR65,SurveyDataContacts,'Survey Contacts'!$DS$24,FALSE)","v":{"$error":"#N/A"}},{"$f":"VLOOKUP($CR65,SurveyDataContacts,'Survey Contacts'!$BV$24,FALSE)","v":{"$error":"#N/A"}},{"$f":"VLOOKUP($CR65,SurveyDataContacts,'Survey Contacts'!$CQ$24,FALSE)","v":{"$error":"#N/A"}},{"$f":"VLOOKUP($CR65,SurveyDataContacts,'Survey Contacts'!$DE$24,FALSE)","v":{"$error":"#N/A"}},{"$error":"#N/A"},{"$error":"#N/A"},{"$error":"#N/A"},{"$error":"#N/A"},1900,"0 - 1900",null,"01900",{"$f":"VLOOKUP($D65,HQ_Contacts,'HQ and Regional Contacts'!$Q$24,FALSE)","v":{"$error":"#N/A"}},{"$f":"VLOOKUP($D65,HQ_Contacts,'HQ and Regional Contacts'!$Y$24,FALSE)","v":{"$error":"#N/A"}},{"$f":"VLOOKUP($D65,HQ_Contacts,'HQ and Regional Contacts'!$AQ$24,FALSE)","v":{"$error":"#N/A"}},"",{"$f":"VLOOKUP($D65,HQ_Contacts,'HQ and Regional Contacts'!$BI$24,FALSE)","v":{"$error":"#N/A"}},{"$f":"VLOOKUP($D65,HQ_Contacts,'HQ and Regional Contacts'!$DX$24,FALSE)","v":{"$error":"#N/A"}},{"$f":"VLOOKUP($D65,HQ_Contacts,'HQ and Regional Contacts'!$CA$24,FALSE)","v":{"$error":"#N/A"}},{"$f":"VLOOKUP($D65,HQ_Contacts,'HQ and Regional Contacts'!$CV$24,FALSE)","v":{"$error":"#N/A"}},{"$f":"VLOOKUP($D65,HQ_Contacts,'HQ and Regional Contacts'!$DJ$24,FALSE)","v":{"$error":"#N/A"}},null,null,"Same Individual","","","","","","","","","","",null,"","Yes",null,null,null,"","00-Jan-1900",{"$error":"#VALUE!"},{"$f":"IF('Order Form'!$L$101=\"NGO\",\"\",\" (CDO Pricing); \")","v":" (CDO Pricing); "},{"$f":"IF(#REF!=\"X\",\"Indigo Access;\",\"\")","v":{"$error":"#REF!"}},"","",{"$f":"IF(#REF!=\"\",\"\",\"Subsector: \"&#REF!&\";\")","v":{"$error":"#REF!"}},"No data to provide;",null,""]
[null,null,13,null,null,null,null,null,null,null,null,null,null,null,null,null,null,"",null,null,null,null,null,null,null,null,null,null,null,null,null,null,null,null,null,"",null,null,null,null,null,null,null,null,null,null,null,null,null,null,null,null,null,null,null,null,null,null,null,null,null,null,null,null,0,0,"","","",0,null,null,"",0,"1901-12-31","1902-12-30",null,null,null,null,null,null,null,null,"2021-03-18",0,"","","","","","","","",0,0,{"$f":"VLOOKUP($CR66,SurveyDataContacts,'Survey Contacts'!$L$24,FALSE)","v":{"$error":"#N/A"}},{"$f":"VLOOKUP($CR66,SurveyDataContacts,'Survey Contacts'!$T$24,FALSE)","v":{"$error":"#N/A"}},{"$f":"VLOOKUP($CR66,SurveyDataContacts,'Survey Contacts'!$AL$24,FALSE)","v":{"$error":"#N/A"}},"",{"$f":"VLOOKUP($CR66,SurveyDataContacts,'Survey Contacts'!$BD$24,FALSE)","v":{"$error":"#N/A"}},{"$f":"VLOOKUP($CR66,SurveyDataContacts,'Survey Contacts'!$DS$24,FALSE)","v":{"$error":"#N/A"}},{"$f":"VLOOKUP($CR66,SurveyDataContacts,'Survey Contacts'!$BV$24,FALSE)","v":{"$error":"#N/A"}},{"$f":"VLOOKUP($CR66,SurveyDataContacts,'Survey Contacts'!$CQ$24,FALSE)","v":{"$error":"#N/A"}},{"$f":"VLOOKUP($CR66,SurveyDataContacts,'Survey Contacts'!$DE$24,FALSE)","v":{"$error":"#N/A"}},{"$error":"#N/A"},{"$error":"#N/A"},{"$error":"#N/A"},{"$error":"#N/A"},1900,"0 - 1900",null,"01900",{"$f":"VLOOKUP($D66,HQ_Contacts,'HQ and Regional Contacts'!$Q$24,FALSE)","v":{"$error":"#N/A"}},{"$f":"VLOOKUP($D66,HQ_Contacts,'HQ and Regional Contacts'!$Y$24,FALSE)","v":{"$error":"#N/A"}},{"$f":"VLOOKUP($D66,HQ_Contacts,'HQ and Regional Contacts'!$AQ$24,FALSE)","v":{"$error":"#N/A"}},"",{"$f":"VLOOKUP($D66,HQ_Contacts,'HQ and Regional Contacts'!$BI$24,FALSE)","v":{"$error":"#N/A"}},{"$f":"VLOOKUP($D66,HQ_Contacts,'HQ and Regional Contacts'!$DX$24,FALSE)","v":{"$error":"#N/A"}},{"$f":"VLOOKUP($D66,HQ_Contacts,'HQ and Regional Contacts'!$CA$24,FALSE)","v":{"$error":"#N/A"}},{"$f":"VLOOKUP($D66,HQ_Contacts,'HQ and Regional Contacts'!$CV$24,FALSE)","v":{"$error":"#N/A"}},{"$f":"VLOOKUP($D66,HQ_Contacts,'HQ and Regional Contacts'!$DJ$24,FALSE)","v":{"$error":"#N/A"}},null,null,"Same Individual","","","","","","","","","","",null,"","Yes",null,null,null,"","00-Jan-1900",{"$error":"#VALUE!"},{"$f":"IF('Order Form'!$L$101=\"NGO\",\"\",\" (CDO Pricing); \")","v":" (CDO Pricing); "},{"$f":"IF(#REF!=\"X\",\"Indigo Access;\",\"\")","v":{"$error":"#REF!"}},"","",{"$f":"IF(#REF!=\"\",\"\",\"Subsector: \"&#REF!&\";\")","v":{"$error":"#REF!"}},"No data to provide;",null,""]
[null,null,14,null,null,null,null,null,null,null,null,null,null,null,null,null,null,"",null,null,null,null,null,null,null,null,null,null,null,null,null,null,null,null,null,"",null,null,null,null,null,null,null,null,null,null,null,null,null,null,null,null,null,null,null,null,null,null,null,null,null,null,null,null,0,0,"","","",0,null,null,"",0,"1901-12-31","1902-12-30",null,null,null,null,null,null,null,null,"2021-03-18",0,"","","","","","","","",0,0,{"$f":"VLOOKUP($CR67,SurveyDataContacts,'Survey Contacts'!$L$24,FALSE)","v":{"$error":"#N/A"}},{"$f":"VLOOKUP($CR67,SurveyDataContacts,'Survey Contacts'!$T$24,FALSE)","v":{"$error":"#N/A"}},{"$f":"VLOOKUP($CR67,SurveyDataContacts,'Survey Contacts'!$AL$24,FALSE)","v":{"$error":"#N/A"}},"",{"$f":"VLOOKUP($CR67,SurveyDataContacts,'Survey Contacts'!$BD$24,FALSE)","v":{"$error":"#N/A"}},{"$f":"VLOOKUP($CR67,SurveyDataContacts,'Survey Contacts'!$DS$24,FALSE)","v":{"$error":"#N/A"}},{"$f":"VLOOKUP($CR67,SurveyDataContacts,'Survey Contacts'!$BV$24,FALSE)","v":{"$error":"#N/A"}},{"$f":"VLOOKUP($CR67,SurveyDataContacts,'Survey Contacts'!$CQ$24,FALSE)","v":{"$error":"#N/A"}},{"$f":"VLOOKUP($CR67,SurveyDataContacts,'Survey Contacts'!$DE$24,FALSE)","v":{"$error":"#N/A"}},{"$error":"#N/A"},{"$error":"#N/A"},{"$error":"#N/A"},{"$error":"#N/A"},1900,"0 - 1900",null,"01900",{"$f":"VLOOKUP($D67,HQ_Contacts,'HQ and Regional Contacts'!$Q$24,FALSE)","v":{"$error":"#N/A"}},{"$f":"VLOOKUP($D67,HQ_Contacts,'HQ and Regional Contacts'!$Y$24,FALSE)","v":{"$error":"#N/A"}},{"$f":"VLOOKUP($D67,HQ_Contacts,'HQ and Regional Contacts'!$AQ$24,FALSE)","v":{"$error":"#N/A"}},"",{"$f":"VLOOKUP($D67,HQ_Contacts,'HQ and Regional Contacts'!$BI$24,FALSE)","v":{"$error":"#N/A"}},{"$f":"VLOOKUP($D67,HQ_Contacts,'HQ and Regional Contacts'!$DX$24,FALSE)","v":{"$error":"#N/A"}},{"$f":"VLOOKUP($D67,HQ_Contacts,'HQ and Regional Contacts'!$CA$24,FALSE)","v":{"$error":"#N/A"}},{"$f":"VLOOKUP($D67,HQ_Contacts,'HQ and Regional Contacts'!$CV$24,FALSE)","v":{"$error":"#N/A"}},{"$f":"VLOOKUP($D67,HQ_Contacts,'HQ and Regional Contacts'!$DJ$24,FALSE)","v":{"$error":"#N/A"}},null,null,"Same Individual","","","","","","","","","","",null,"","Yes",null,null,null,"","00-Jan-1900",{"$error":"#VALUE!"},{"$f":"IF('Order Form'!$L$101=\"NGO\",\"\",\" (CDO Pricing); \")","v":" (CDO Pricing); "},{"$f":"IF(#REF!=\"X\",\"Indigo Access;\",\"\")","v":{"$error":"#REF!"}},"","",{"$f":"IF(#REF!=\"\",\"\",\"Subsector: \"&#REF!&\";\")","v":{"$error":"#REF!"}},"No data to provide;",null,""]
[null,null,15,null,null,null,null,null,null,null,null,null,null,null,null,null,null,"",null,null,null,null,null,null,null,null,null,null,null,null,null,null,null,null,null,"",null,null,null,null,null,null,null,null,null,null,null,null,null,null,null,null,null,null,null,null,null,null,null,null,null,null,null,null,0,0,"","","",0,null,null,"",0,"1901-12-31","1902-12-30",null,null,null,null,null,null,null,null,"2021-03-18",0,"","","","","","","","",0,0,{"$f":"VLOOKUP($CR68,SurveyDataContacts,'Survey Contacts'!$L$24,FALSE)","v":{"$error":"#N/A"}},{"$f":"VLOOKUP($CR68,SurveyDataContacts,'Survey Contacts'!$T$24,FALSE)","v":{"$error":"#N/A"}},{"$f":"VLOOKUP($CR68,SurveyDataContacts,'Survey Contacts'!$AL$24,FALSE)","v":{"$error":"#N/A"}},"",{"$f":"VLOOKUP($CR68,SurveyDataContacts,'Survey Contacts'!$BD$24,FALSE)","v":{"$error":"#N/A"}},{"$f":"VLOOKUP($CR68,SurveyDataContacts,'Survey Contacts'!$DS$24,FALSE)","v":{"$error":"#N/A"}},{"$f":"VLOOKUP($CR68,SurveyDataContacts,'Survey Contacts'!$BV$24,FALSE)","v":{"$error":"#N/A"}},{"$f":"VLOOKUP($CR68,SurveyDataContacts,'Survey Contacts'!$CQ$24,FALSE)","v":{"$error":"#N/A"}},{"$f":"VLOOKUP($CR68,SurveyDataContacts,'Survey Contacts'!$DE$24,FALSE)","v":{"$error":"#N/A"}},{"$error":"#N/A"},{"$error":"#N/A"},{"$error":"#N/A"},{"$error":"#N/A"},1900,"0 - 1900",null,"01900",{"$f":"VLOOKUP($D68,HQ_Contacts,'HQ and Regional Contacts'!$Q$24,FALSE)","v":{"$error":"#N/A"}},{"$f":"VLOOKUP($D68,HQ_Contacts,'HQ and Regional Contacts'!$Y$24,FALSE)","v":{"$error":"#N/A"}},{"$f":"VLOOKUP($D68,HQ_Contacts,'HQ and Regional Contacts'!$AQ$24,FALSE)","v":{"$error":"#N/A"}},"",{"$f":"VLOOKUP($D68,HQ_Contacts,'HQ and Regional Contacts'!$BI$24,FALSE)","v":{"$error":"#N/A"}},{"$f":"VLOOKUP($D68,HQ_Contacts,'HQ and Regional Contacts'!$DX$24,FALSE)","v":{"$error":"#N/A"}},{"$f":"VLOOKUP($D68,HQ_Contacts,'HQ and Regional Contacts'!$CA$24,FALSE)","v":{"$error":"#N/A"}},{"$f":"VLOOKUP($D68,HQ_Contacts,'HQ and Regional Contacts'!$CV$24,FALSE)","v":{"$error":"#N/A"}},{"$f":"VLOOKUP($D68,HQ_Contacts,'HQ and Regional Contacts'!$DJ$24,FALSE)","v":{"$error":"#N/A"}},null,null,"Same Individual","","","","","","","","","","",null,"","Yes",null,null,null,"","00-Jan-1900",{"$error":"#VALUE!"},{"$f":"IF('Order Form'!$L$101=\"NGO\",\"\",\" (CDO Pricing); \")","v":" (CDO Pricing); "},{"$f":"IF(#REF!=\"X\",\"Indigo Access;\",\"\")","v":{"$error":"#REF!"}},"","",{"$f":"IF(#REF!=\"\",\"\",\"Subsector: \"&#REF!&\";\")","v":{"$error":"#REF!"}},"No data to provide;",null,""]
[null,null,16,null,null,null,null,null,null,null,null,null,null,null,null,null,null,"",null,null,null,null,null,null,null,null,null,null,null,null,null,null,null,null,null,"",null,null,null,null,null,null,null,null,null,null,null,null,null,null,null,null,null,null,null,null,null,null,null,null,null,null,null,null,0,0,"","","",0,null,null,"",0,"1901-12-31","1902-12-30",null,null,null,null,null,null,null,null,"2021-03-18",0,"","","","","","","","",0,0,{"$f":"VLOOKUP($CR69,SurveyDataContacts,'Survey Contacts'!$L$24,FALSE)","v":{"$error":"#N/A"}},{"$f":"VLOOKUP($CR69,SurveyDataContacts,'Survey Contacts'!$T$24,FALSE)","v":{"$error":"#N/A"}},{"$f":"VLOOKUP($CR69,SurveyDataContacts,'Survey Contacts'!$AL$24,FALSE)","v":{"$error":"#N/A"}},"",{"$f":"VLOOKUP($CR69,SurveyDataContacts,'Survey Contacts'!$BD$24,FALSE)","v":{"$error":"#N/A"}},{"$f":"VLOOKUP($CR69,SurveyDataContacts,'Survey Contacts'!$DS$24,FALSE)","v":{"$error":"#N/A"}},{"$f":"VLOOKUP($CR69,SurveyDataContacts,'Survey Contacts'!$BV$24,FALSE)","v":{"$error":"#N/A"}},{"$f":"VLOOKUP($CR69,SurveyDataContacts,'Survey Contacts'!$CQ$24,FALSE)","v":{"$error":"#N/A"}},{"$f":"VLOOKUP($CR69,SurveyDataContacts,'Survey Contacts'!$DE$24,FALSE)","v":{"$error":"#N/A"}},{"$error":"#N/A"},{"$error":"#N/A"},{"$error":"#N/A"},{"$error":"#N/A"},1900,"0 - 1900",null,"01900",{"$f":"VLOOKUP($D69,HQ_Contacts,'HQ and Regional Contacts'!$Q$24,FALSE)","v":{"$error":"#N/A"}},{"$f":"VLOOKUP($D69,HQ_Contacts,'HQ and Regional Contacts'!$Y$24,FALSE)","v":{"$error":"#N/A"}},{"$f":"VLOOKUP($D69,HQ_Contacts,'HQ and Regional Contacts'!$AQ$24,FALSE)","v":{"$error":"#N/A"}},"",{"$f":"VLOOKUP($D69,HQ_Contacts,'HQ and Regional Contacts'!$BI$24,FALSE)","v":{"$error":"#N/A"}},{"$f":"VLOOKUP($D69,HQ_Contacts,'HQ and Regional Contacts'!$DX$24,FALSE)","v":{"$error":"#N/A"}},{"$f":"VLOOKUP($D69,HQ_Contacts,'HQ and Regional Contacts'!$CA$24,FALSE)","v":{"$error":"#N/A"}},{"$f":"VLOOKUP($D69,HQ_Contacts,'HQ and Regional Contacts'!$CV$24,FALSE)","v":{"$error":"#N/A"}},{"$f":"VLOOKUP($D69,HQ_Contacts,'HQ and Regional Contacts'!$DJ$24,FALSE)","v":{"$error":"#N/A"}},null,null,"Same Individual","","","","","","","","","","",null,"","Yes",null,null,null,"","00-Jan-1900",{"$error":"#VALUE!"},{"$f":"IF('Order Form'!$L$101=\"NGO\",\"\",\" (CDO Pricing); \")","v":" (CDO Pricing); "},{"$f":"IF(#REF!=\"X\",\"Indigo Access;\",\"\")","v":{"$error":"#REF!"}},"","",{"$f":"IF(#REF!=\"\",\"\",\"Subsector: \"&#REF!&\";\")","v":{"$error":"#REF!"}},"No data to provide;",null,""]
[null,null,17,null,null,null,null,null,null,null,null,null,null,null,null,null,null,"",null,null,null,null,null,null,null,null,null,null,null,null,null,null,null,null,null,"",null,null,null,null,null,null,null,null,null,null,null,null,null,null,null,null,null,null,null,null,null,null,null,null,null,null,null,null,0,0,"","","",0,null,null,"",0,"1901-12-31","1902-12-30",null,null,null,null,null,null,null,null,"2021-03-18",0,"","","","","","","","",0,0,{"$f":"VLOOKUP($CR70,SurveyDataContacts,'Survey Contacts'!$L$24,FALSE)","v":{"$error":"#N/A"}},{"$f":"VLOOKUP($CR70,SurveyDataContacts,'Survey Contacts'!$T$24,FALSE)","v":{"$error":"#N/A"}},{"$f":"VLOOKUP($CR70,SurveyDataContacts,'Survey Contacts'!$AL$24,FALSE)","v":{"$error":"#N/A"}},"",{"$f":"VLOOKUP($CR70,SurveyDataContacts,'Survey Contacts'!$BD$24,FALSE)","v":{"$error":"#N/A"}},{"$f":"VLOOKUP($CR70,SurveyDataContacts,'Survey Contacts'!$DS$24,FALSE)","v":{"$error":"#N/A"}},{"$f":"VLOOKUP($CR70,SurveyDataContacts,'Survey Contacts'!$BV$24,FALSE)","v":{"$error":"#N/A"}},{"$f":"VLOOKUP($CR70,SurveyDataContacts,'Survey Contacts'!$CQ$24,FALSE)","v":{"$error":"#N/A"}},{"$f":"VLOOKUP($CR70,SurveyDataContacts,'Survey Contacts'!$DE$24,FALSE)","v":{"$error":"#N/A"}},{"$error":"#N/A"},{"$error":"#N/A"},{"$error":"#N/A"},{"$error":"#N/A"},1900,"0 - 1900",null,"01900",{"$f":"VLOOKUP($D70,HQ_Contacts,'HQ and Regional Contacts'!$Q$24,FALSE)","v":{"$error":"#N/A"}},{"$f":"VLOOKUP($D70,HQ_Contacts,'HQ and Regional Contacts'!$Y$24,FALSE)","v":{"$error":"#N/A"}},{"$f":"VLOOKUP($D70,HQ_Contacts,'HQ and Regional Contacts'!$AQ$24,FALSE)","v":{"$error":"#N/A"}},"",{"$f":"VLOOKUP($D70,HQ_Contacts,'HQ and Regional Contacts'!$BI$24,FALSE)","v":{"$error":"#N/A"}},{"$f":"VLOOKUP($D70,HQ_Contacts,'HQ and Regional Contacts'!$DX$24,FALSE)","v":{"$error":"#N/A"}},{"$f":"VLOOKUP($D70,HQ_Contacts,'HQ and Regional Contacts'!$CA$24,FALSE)","v":{"$error":"#N/A"}},{"$f":"VLOOKUP($D70,HQ_Contacts,'HQ and Regional Contacts'!$CV$24,FALSE)","v":{"$error":"#N/A"}},{"$f":"VLOOKUP($D70,HQ_Contacts,'HQ and Regional Contacts'!$DJ$24,FALSE)","v":{"$error":"#N/A"}},null,null,"Same Individual","","","","","","","","","","",null,"","Yes",null,null,null,"","00-Jan-1900",{"$error":"#VALUE!"},{"$f":"IF('Order Form'!$L$101=\"NGO\",\"\",\" (CDO Pricing); \")","v":" (CDO Pricing); "},{"$f":"IF(#REF!=\"X\",\"Indigo Access;\",\"\")","v":{"$error":"#REF!"}},"","",{"$f":"IF(#REF!=\"\",\"\",\"Subsector: \"&#REF!&\";\")","v":{"$error":"#REF!"}},"No data to provide;",null,""]
[null,null,18,null,null,null,null,null,null,null,null,null,null,null,null,null,null,"",null,null,null,null,null,null,null,null,null,null,null,null,null,null,null,null,null,"",null,null,null,null,null,null,null,null,null,null,null,null,null,null,null,null,null,null,null,null,null,null,null,null,null,null,null,null,0,0,"","","",0,null,null,"",0,"1901-12-31","1902-12-30",null,null,null,null,null,null,null,null,"2021-03-18",0,"","","","","","","","",0,0,{"$f":"VLOOKUP($CR71,SurveyDataContacts,'Survey Contacts'!$L$24,FALSE)","v":{"$error":"#N/A"}},{"$f":"VLOOKUP($CR71,SurveyDataContacts,'Survey Contacts'!$T$24,FALSE)","v":{"$error":"#N/A"}},{"$f":"VLOOKUP($CR71,SurveyDataContacts,'Survey Contacts'!$AL$24,FALSE)","v":{"$error":"#N/A"}},"",{"$f":"VLOOKUP($CR71,SurveyDataContacts,'Survey Contacts'!$BD$24,FALSE)","v":{"$error":"#N/A"}},{"$f":"VLOOKUP($CR71,SurveyDataContacts,'Survey Contacts'!$DS$24,FALSE)","v":{"$error":"#N/A"}},{"$f":"VLOOKUP($CR71,SurveyDataContacts,'Survey Contacts'!$BV$24,FALSE)","v":{"$error":"#N/A"}},{"$f":"VLOOKUP($CR71,SurveyDataContacts,'Survey Contacts'!$CQ$24,FALSE)","v":{"$error":"#N/A"}},{"$f":"VLOOKUP($CR71,SurveyDataContacts,'Survey Contacts'!$DE$24,FALSE)","v":{"$error":"#N/A"}},{"$error":"#N/A"},{"$error":"#N/A"},{"$error":"#N/A"},{"$error":"#N/A"},1900,"0 - 1900",null,"01900",{"$f":"VLOOKUP($D71,HQ_Contacts,'HQ and Regional Contacts'!$Q$24,FALSE)","v":{"$error":"#N/A"}},{"$f":"VLOOKUP($D71,HQ_Contacts,'HQ and Regional Contacts'!$Y$24,FALSE)","v":{"$error":"#N/A"}},{"$f":"VLOOKUP($D71,HQ_Contacts,'HQ and Regional Contacts'!$AQ$24,FALSE)","v":{"$error":"#N/A"}},"",{"$f":"VLOOKUP($D71,HQ_Contacts,'HQ and Regional Contacts'!$BI$24,FALSE)","v":{"$error":"#N/A"}},{"$f":"VLOOKUP($D71,HQ_Contacts,'HQ and Regional Contacts'!$DX$24,FALSE)","v":{"$error":"#N/A"}},{"$f":"VLOOKUP($D71,HQ_Contacts,'HQ and Regional Contacts'!$CA$24,FALSE)","v":{"$error":"#N/A"}},{"$f":"VLOOKUP($D71,HQ_Contacts,'HQ and Regional Contacts'!$CV$24,FALSE)","v":{"$error":"#N/A"}},{"$f":"VLOOKUP($D71,HQ_Contacts,'HQ and Regional Contacts'!$DJ$24,FALSE)","v":{"$error":"#N/A"}},null,null,"Same Individual","","","","","","","","","","",null,"","Yes",null,null,null,"","00-Jan-1900",{"$error":"#VALUE!"},{"$f":"IF('Order Form'!$L$101=\"NGO\",\"\",\" (CDO Pricing); \")","v":" (CDO Pricing); "},{"$f":"IF(#REF!=\"X\",\"Indigo Access;\",\"\")","v":{"$error":"#REF!"}},"","",{"$f":"IF(#REF!=\"\",\"\",\"Subsector: \"&#REF!&\";\")","v":{"$error":"#REF!"}},"No data to provide;",null,{"$f":"IF(EL71=\"\",\"\",EL71&EM71&\" - \"&EN71&EO71&EP71&EQ71&ER71&ES71&ET71)","v":""}]
[null,null,19,null,null,null,null,null,null,null,null,null,null,null,null,null,null,"",null,null,null,null,null,null,null,null,null,null,null,null,null,null,null,null,null,"",null,null,null,null,null,null,null,null,null,null,null,null,null,null,null,null,null,null,null,null,null,null,null,null,null,null,null,null,0,0,"","","",0,null,null,"",0,"1901-12-31","1902-12-30",null,null,null,null,null,null,null,null,"2021-03-18",0,"","","","","","","","",0,0,{"$f":"VLOOKUP($CR72,SurveyDataContacts,'Survey Contacts'!$L$24,FALSE)","v":{"$error":"#N/A"}},{"$f":"VLOOKUP($CR72,SurveyDataContacts,'Survey Contacts'!$T$24,FALSE)","v":{"$error":"#N/A"}},{"$f":"VLOOKUP($CR72,SurveyDataContacts,'Survey Contacts'!$AL$24,FALSE)","v":{"$error":"#N/A"}},"",{"$f":"VLOOKUP($CR72,SurveyDataContacts,'Survey Contacts'!$BD$24,FALSE)","v":{"$error":"#N/A"}},{"$f":"VLOOKUP($CR72,SurveyDataContacts,'Survey Contacts'!$DS$24,FALSE)","v":{"$error":"#N/A"}},{"$f":"VLOOKUP($CR72,SurveyDataContacts,'Survey Contacts'!$BV$24,FALSE)","v":{"$error":"#N/A"}},{"$f":"VLOOKUP($CR72,SurveyDataContacts,'Survey Contacts'!$CQ$24,FALSE)","v":{"$error":"#N/A"}},{"$f":"VLOOKUP($CR72,SurveyDataContacts,'Survey Contacts'!$DE$24,FALSE)","v":{"$error":"#N/A"}},{"$error":"#N/A"},{"$error":"#N/A"},{"$error":"#N/A"},{"$error":"#N/A"},1900,"0 - 1900",null,"01900",{"$f":"VLOOKUP($D72,HQ_Contacts,'HQ and Regional Contacts'!$Q$24,FALSE)","v":{"$error":"#N/A"}},{"$f":"VLOOKUP($D72,HQ_Contacts,'HQ and Regional Contacts'!$Y$24,FALSE)","v":{"$error":"#N/A"}},{"$f":"VLOOKUP($D72,HQ_Contacts,'HQ and Regional Contacts'!$AQ$24,FALSE)","v":{"$error":"#N/A"}},"",{"$f":"VLOOKUP($D72,HQ_Contacts,'HQ and Regional Contacts'!$BI$24,FALSE)","v":{"$error":"#N/A"}},{"$f":"VLOOKUP($D72,HQ_Contacts,'HQ and Regional Contacts'!$DX$24,FALSE)","v":{"$error":"#N/A"}},{"$f":"VLOOKUP($D72,HQ_Contacts,'HQ and Regional Contacts'!$CA$24,FALSE)","v":{"$error":"#N/A"}},{"$f":"VLOOKUP($D72,HQ_Contacts,'HQ and Regional Contacts'!$CV$24,FALSE)","v":{"$error":"#N/A"}},{"$f":"VLOOKUP($D72,HQ_Contacts,'HQ and Regional Contacts'!$DJ$24,FALSE)","v":{"$error":"#N/A"}},null,null,"Same Individual","","","","","","","","","","",null,"","Yes",null,null,null,"","00-Jan-1900",{"$error":"#VALUE!"},{"$f":"IF('Order Form'!$L$101=\"NGO\",\"\",\" (CDO Pricing); \")","v":" (CDO Pricing); "},{"$f":"IF(#REF!=\"X\",\"Indigo Access;\",\"\")","v":{"$error":"#REF!"}},"","",{"$f":"IF(#REF!=\"\",\"\",\"Subsector: \"&#REF!&\";\")","v":{"$error":"#REF!"}},"No data to provide;",null,""]
[null,null,20,null,null,null,null,null,null,null,null,null,null,null,null,null,null,"",null,null,null,null,null,null,null,null,null,null,null,null,null,null,null,null,null,"",null,null,null,null,null,null,null,null,null,null,null,null,null,null,null,null,null,null,null,null,null,null,null,null,null,null,null,null,0,0,"","","",0,null,null,"",0,"1901-12-31","1902-12-30",null,null,null,null,null,null,null,null,"2021-03-18",0,"","","","","","","","",0,0,{"$f":"VLOOKUP($CR73,SurveyDataContacts,'Survey Contacts'!$L$24,FALSE)","v":{"$error":"#N/A"}},{"$f":"VLOOKUP($CR73,SurveyDataContacts,'Survey Contacts'!$T$24,FALSE)","v":{"$error":"#N/A"}},{"$f":"VLOOKUP($CR73,SurveyDataContacts,'Survey Contacts'!$AL$24,FALSE)","v":{"$error":"#N/A"}},"",{"$f":"VLOOKUP($CR73,SurveyDataContacts,'Survey Contacts'!$BD$24,FALSE)","v":{"$error":"#N/A"}},{"$f":"VLOOKUP($CR73,SurveyDataContacts,'Survey Contacts'!$DS$24,FALSE)","v":{"$error":"#N/A"}},{"$f":"VLOOKUP($CR73,SurveyDataContacts,'Survey Contacts'!$BV$24,FALSE)","v":{"$error":"#N/A"}},{"$f":"VLOOKUP($CR73,SurveyDataContacts,'Survey Contacts'!$CQ$24,FALSE)","v":{"$error":"#N/A"}},{"$f":"VLOOKUP($CR73,SurveyDataContacts,'Survey Contacts'!$DE$24,FALSE)","v":{"$error":"#N/A"}},{"$error":"#N/A"},{"$error":"#N/A"},{"$error":"#N/A"},{"$error":"#N/A"},1900,"0 - 1900",null,"01900",{"$f":"VLOOKUP($D73,HQ_Contacts,'HQ and Regional Contacts'!$Q$24,FALSE)","v":{"$error":"#N/A"}},{"$f":"VLOOKUP($D73,HQ_Contacts,'HQ and Regional Contacts'!$Y$24,FALSE)","v":{"$error":"#N/A"}},{"$f":"VLOOKUP($D73,HQ_Contacts,'HQ and Regional Contacts'!$AQ$24,FALSE)","v":{"$error":"#N/A"}},"",{"$f":"VLOOKUP($D73,HQ_Contacts,'HQ and Regional Contacts'!$BI$24,FALSE)","v":{"$error":"#N/A"}},{"$f":"VLOOKUP($D73,HQ_Contacts,'HQ and Regional Contacts'!$DX$24,FALSE)","v":{"$error":"#N/A"}},{"$f":"VLOOKUP($D73,HQ_Contacts,'HQ and Regional Contacts'!$CA$24,FALSE)","v":{"$error":"#N/A"}},{"$f":"VLOOKUP($D73,HQ_Contacts,'HQ and Regional Contacts'!$CV$24,FALSE)","v":{"$error":"#N/A"}},{"$f":"VLOOKUP($D73,HQ_Contacts,'HQ and Regional Contacts'!$DJ$24,FALSE)","v":{"$error":"#N/A"}},null,null,"Same Individual","","","","","","","","","","",null,"","Yes",null,null,null,"","00-Jan-1900",{"$error":"#VALUE!"},{"$f":"IF('Order Form'!$L$101=\"NGO\",\"\",\" (CDO Pricing); \")","v":" (CDO Pricing); "},{"$f":"IF(#REF!=\"X\",\"Indigo Access;\",\"\")","v":{"$error":"#REF!"}},"","",{"$f":"IF(#REF!=\"\",\"\",\"Subsector: \"&#REF!&\";\")","v":{"$error":"#REF!"}},"No data to provide;",null,""]
[null,null,21,null,null,null,null,null,null,null,null,null,null,null,null,null,null,"",null,null,null,null,null,null,null,null,null,null,null,null,null,null,null,null,null,"",null,null,null,null,null,null,null,null,null,null,null,null,null,null,null,null,null,null,null,null,null,null,null,null,null,null,null,null,0,0,"","","",0,null,null,"",0,"1901-12-31","1902-12-30",null,null,null,null,null,null,null,null,"2021-03-18",0,"","","","","","","","",0,0,{"$f":"VLOOKUP($CR74,SurveyDataContacts,'Survey Contacts'!$L$24,FALSE)","v":{"$error":"#N/A"}},{"$f":"VLOOKUP($CR74,SurveyDataContacts,'Survey Contacts'!$T$24,FALSE)","v":{"$error":"#N/A"}},{"$f":"VLOOKUP($CR74,SurveyDataContacts,'Survey Contacts'!$AL$24,FALSE)","v":{"$error":"#N/A"}},"",{"$f":"VLOOKUP($CR74,SurveyDataContacts,'Survey Contacts'!$BD$24,FALSE)","v":{"$error":"#N/A"}},{"$f":"VLOOKUP($CR74,SurveyDataContacts,'Survey Contacts'!$DS$24,FALSE)","v":{"$error":"#N/A"}},{"$f":"VLOOKUP($CR74,SurveyDataContacts,'Survey Contacts'!$BV$24,FALSE)","v":{"$error":"#N/A"}},{"$f":"VLOOKUP($CR74,SurveyDataContacts,'Survey Contacts'!$CQ$24,FALSE)","v":{"$error":"#N/A"}},{"$f":"VLOOKUP($CR74,SurveyDataContacts,'Survey Contacts'!$DE$24,FALSE)","v":{"$error":"#N/A"}},{"$error":"#N/A"},{"$error":"#N/A"},{"$error":"#N/A"},{"$error":"#N/A"},1900,"0 - 1900",null,"01900",{"$f":"VLOOKUP($D74,HQ_Contacts,'HQ and Regional Contacts'!$Q$24,FALSE)","v":{"$error":"#N/A"}},{"$f":"VLOOKUP($D74,HQ_Contacts,'HQ and Regional Contacts'!$Y$24,FALSE)","v":{"$error":"#N/A"}},{"$f":"VLOOKUP($D74,HQ_Contacts,'HQ and Regional Contacts'!$AQ$24,FALSE)","v":{"$error":"#N/A"}},"",{"$f":"VLOOKUP($D74,HQ_Contacts,'HQ and Regional Contacts'!$BI$24,FALSE)","v":{"$error":"#N/A"}},{"$f":"VLOOKUP($D74,HQ_Contacts,'HQ and Regional Contacts'!$DX$24,FALSE)","v":{"$error":"#N/A"}},{"$f":"VLOOKUP($D74,HQ_Contacts,'HQ and Regional Contacts'!$CA$24,FALSE)","v":{"$error":"#N/A"}},{"$f":"VLOOKUP($D74,HQ_Contacts,'HQ and Regional Contacts'!$CV$24,FALSE)","v":{"$error":"#N/A"}},{"$f":"VLOOKUP($D74,HQ_Contacts,'HQ and Regional Contacts'!$DJ$24,FALSE)","v":{"$error":"#N/A"}},null,null,"Same Individual","","","","","","","","","","",null,"","Yes",null,null,null,"","00-Jan-1900",{"$error":"#VALUE!"},{"$f":"IF('Order Form'!$L$101=\"NGO\",\"\",\" (CDO Pricing); \")","v":" (CDO Pricing); "},{"$f":"IF(#REF!=\"X\",\"Indigo Access;\",\"\")","v":{"$error":"#REF!"}},"","",{"$f":"IF(#REF!=\"\",\"\",\"Subsector: \"&#REF!&\";\")","v":{"$error":"#REF!"}},"No data to provide;",null,""]
[null,null,22,null,null,null,null,null,null,null,null,null,null,null,null,null,null,"",null,null,null,null,null,null,null,null,null,null,null,null,null,null,null,null,null,"",null,null,null,null,null,null,null,null,null,null,null,null,null,null,null,null,null,null,null,null,null,null,null,null,null,null,null,null,0,0,"","","",0,null,null,"",0,"1901-12-31","1902-12-30",null,null,null,null,null,null,null,null,"2021-03-18",0,"","","","","","","","",0,0,{"$f":"VLOOKUP($CR75,SurveyDataContacts,'Survey Contacts'!$L$24,FALSE)","v":{"$error":"#N/A"}},{"$f":"VLOOKUP($CR75,SurveyDataContacts,'Survey Contacts'!$T$24,FALSE)","v":{"$error":"#N/A"}},{"$f":"VLOOKUP($CR75,SurveyDataContacts,'Survey Contacts'!$AL$24,FALSE)","v":{"$error":"#N/A"}},"",{"$f":"VLOOKUP($CR75,SurveyDataContacts,'Survey Contacts'!$BD$24,FALSE)","v":{"$error":"#N/A"}},{"$f":"VLOOKUP($CR75,SurveyDataContacts,'Survey Contacts'!$DS$24,FALSE)","v":{"$error":"#N/A"}},{"$f":"VLOOKUP($CR75,SurveyDataContacts,'Survey Contacts'!$BV$24,FALSE)","v":{"$error":"#N/A"}},{"$f":"VLOOKUP($CR75,SurveyDataContacts,'Survey Contacts'!$CQ$24,FALSE)","v":{"$error":"#N/A"}},{"$f":"VLOOKUP($CR75,SurveyDataContacts,'Survey Contacts'!$DE$24,FALSE)","v":{"$error":"#N/A"}},{"$error":"#N/A"},{"$error":"#N/A"},{"$error":"#N/A"},{"$error":"#N/A"},1900,"0 - 1900",null,"01900",{"$f":"VLOOKUP($D75,HQ_Contacts,'HQ and Regional Contacts'!$Q$24,FALSE)","v":{"$error":"#N/A"}},{"$f":"VLOOKUP($D75,HQ_Contacts,'HQ and Regional Contacts'!$Y$24,FALSE)","v":{"$error":"#N/A"}},{"$f":"VLOOKUP($D75,HQ_Contacts,'HQ and Regional Contacts'!$AQ$24,FALSE)","v":{"$error":"#N/A"}},"",{"$f":"VLOOKUP($D75,HQ_Contacts,'HQ and Regional Contacts'!$BI$24,FALSE)","v":{"$error":"#N/A"}},{"$f":"VLOOKUP($D75,HQ_Contacts,'HQ and Regional Contacts'!$DX$24,FALSE)","v":{"$error":"#N/A"}},{"$f":"VLOOKUP($D75,HQ_Contacts,'HQ and Regional Contacts'!$CA$24,FALSE)","v":{"$error":"#N/A"}},{"$f":"VLOOKUP($D75,HQ_Contacts,'HQ and Regional Contacts'!$CV$24,FALSE)","v":{"$error":"#N/A"}},{"$f":"VLOOKUP($D75,HQ_Contacts,'HQ and Regional Contacts'!$DJ$24,FALSE)","v":{"$error":"#N/A"}},null,null,"Same Individual","","","","","","","","","","",null,"","Yes",null,null,null,"","00-Jan-1900",{"$error":"#VALUE!"},{"$f":"IF('Order Form'!$L$101=\"NGO\",\"\",\" (CDO Pricing); \")","v":" (CDO Pricing); "},{"$f":"IF(#REF!=\"X\",\"Indigo Access;\",\"\")","v":{"$error":"#REF!"}},"","",{"$f":"IF(#REF!=\"\",\"\",\"Subsector: \"&#REF!&\";\")","v":{"$error":"#REF!"}},"No data to provide;",null,""]
[null,null,23,null,null,null,null,null,null,null,null,null,null,null,null,null,null,"",null,null,null,null,null,null,null,null,null,null,null,null,null,null,null,null,null,"",null,null,null,null,null,null,null,null,null,null,null,null,null,null,null,null,null,null,null,null,null,null,null,null,null,null,null,null,0,0,"","","",0,null,null,"",0,"1901-12-31","1902-12-30",null,null,null,null,null,null,null,null,"2021-03-18",0,"","","","","","","","",0,0,{"$f":"VLOOKUP($CR76,SurveyDataContacts,'Survey Contacts'!$L$24,FALSE)","v":{"$error":"#N/A"}},{"$f":"VLOOKUP($CR76,SurveyDataContacts,'Survey Contacts'!$T$24,FALSE)","v":{"$error":"#N/A"}},{"$f":"VLOOKUP($CR76,SurveyDataContacts,'Survey Contacts'!$AL$24,FALSE)","v":{"$error":"#N/A"}},"",{"$f":"VLOOKUP($CR76,SurveyDataContacts,'Survey Contacts'!$BD$24,FALSE)","v":{"$error":"#N/A"}},{"$f":"VLOOKUP($CR76,SurveyDataContacts,'Survey Contacts'!$DS$24,FALSE)","v":{"$error":"#N/A"}},{"$f":"VLOOKUP($CR76,SurveyDataContacts,'Survey Contacts'!$BV$24,FALSE)","v":{"$error":"#N/A"}},{"$f":"VLOOKUP($CR76,SurveyDataContacts,'Survey Contacts'!$CQ$24,FALSE)","v":{"$error":"#N/A"}},{"$f":"VLOOKUP($CR76,SurveyDataContacts,'Survey Contacts'!$DE$24,FALSE)","v":{"$error":"#N/A"}},{"$error":"#N/A"},{"$error":"#N/A"},{"$error":"#N/A"},{"$error":"#N/A"},1900,"0 - 1900",null,"01900",{"$f":"VLOOKUP($D76,HQ_Contacts,'HQ and Regional Contacts'!$Q$24,FALSE)","v":{"$error":"#N/A"}},{"$f":"VLOOKUP($D76,HQ_Contacts,'HQ and Regional Contacts'!$Y$24,FALSE)","v":{"$error":"#N/A"}},{"$f":"VLOOKUP($D76,HQ_Contacts,'HQ and Regional Contacts'!$AQ$24,FALSE)","v":{"$error":"#N/A"}},"",{"$f":"VLOOKUP($D76,HQ_Contacts,'HQ and Regional Contacts'!$BI$24,FALSE)","v":{"$error":"#N/A"}},{"$f":"VLOOKUP($D76,HQ_Contacts,'HQ and Regional Contacts'!$DX$24,FALSE)","v":{"$error":"#N/A"}},{"$f":"VLOOKUP($D76,HQ_Contacts,'HQ and Regional Contacts'!$CA$24,FALSE)","v":{"$error":"#N/A"}},{"$f":"VLOOKUP($D76,HQ_Contacts,'HQ and Regional Contacts'!$CV$24,FALSE)","v":{"$error":"#N/A"}},{"$f":"VLOOKUP($D76,HQ_Contacts,'HQ and Regional Contacts'!$DJ$24,FALSE)","v":{"$error":"#N/A"}},null,null,"Same Individual","","","","","","","","","","",null,"","Yes",null,null,null,"","00-Jan-1900",{"$error":"#VALUE!"},{"$f":"IF('Order Form'!$L$101=\"NGO\",\"\",\" (CDO Pricing); \")","v":" (CDO Pricing); "},{"$f":"IF(#REF!=\"X\",\"Indigo Access;\",\"\")","v":{"$error":"#REF!"}},"","",{"$f":"IF(#REF!=\"\",\"\",\"Subsector: \"&#REF!&\";\")","v":{"$error":"#REF!"}},"No data to provide;",null,""]
[null,null,24,null,null,null,null,null,null,null,null,null,null,null,null,null,null,"",null,null,null,null,null,null,null,null,null,null,null,null,null,null,null,null,null,"",null,null,null,null,null,null,null,null,null,null,null,null,null,null,null,null,null,null,null,null,null,null,null,null,null,null,null,null,0,0,"","","",0,null,null,"",0,"1901-12-31","1902-12-30",null,null,null,null,null,null,null,null,"2021-03-18",0,"","","","","","","","",0,0,{"$f":"VLOOKUP($CR77,SurveyDataContacts,'Survey Contacts'!$L$24,FALSE)","v":{"$error":"#N/A"}},{"$f":"VLOOKUP($CR77,SurveyDataContacts,'Survey Contacts'!$T$24,FALSE)","v":{"$error":"#N/A"}},{"$f":"VLOOKUP($CR77,SurveyDataContacts,'Survey Contacts'!$AL$24,FALSE)","v":{"$error":"#N/A"}},"",{"$f":"VLOOKUP($CR77,SurveyDataContacts,'Survey Contacts'!$BD$24,FALSE)","v":{"$error":"#N/A"}},{"$f":"VLOOKUP($CR77,SurveyDataContacts,'Survey Contacts'!$DS$24,FALSE)","v":{"$error":"#N/A"}},{"$f":"VLOOKUP($CR77,SurveyDataContacts,'Survey Contacts'!$BV$24,FALSE)","v":{"$error":"#N/A"}},{"$f":"VLOOKUP($CR77,SurveyDataContacts,'Survey Contacts'!$CQ$24,FALSE)","v":{"$error":"#N/A"}},{"$f":"VLOOKUP($CR77,SurveyDataContacts,'Survey Contacts'!$DE$24,FALSE)","v":{"$error":"#N/A"}},{"$error":"#N/A"},{"$error":"#N/A"},{"$error":"#N/A"},{"$error":"#N/A"},1900,"0 - 1900",null,"01900",{"$f":"VLOOKUP($D77,HQ_Contacts,'HQ and Regional Contacts'!$Q$24,FALSE)","v":{"$error":"#N/A"}},{"$f":"VLOOKUP($D77,HQ_Contacts,'HQ and Regional Contacts'!$Y$24,FALSE)","v":{"$error":"#N/A"}},{"$f":"VLOOKUP($D77,HQ_Contacts,'HQ and Regional Contacts'!$AQ$24,FALSE)","v":{"$error":"#N/A"}},"",{"$f":"VLOOKUP($D77,HQ_Contacts,'HQ and Regional Contacts'!$BI$24,FALSE)","v":{"$error":"#N/A"}},{"$f":"VLOOKUP($D77,HQ_Contacts,'HQ and Regional Contacts'!$DX$24,FALSE)","v":{"$error":"#N/A"}},{"$f":"VLOOKUP($D77,HQ_Contacts,'HQ and Regional Contacts'!$CA$24,FALSE)","v":{"$error":"#N/A"}},{"$f":"VLOOKUP($D77,HQ_Contacts,'HQ and Regional Contacts'!$CV$24,FALSE)","v":{"$error":"#N/A"}},{"$f":"VLOOKUP($D77,HQ_Contacts,'HQ and Regional Contacts'!$DJ$24,FALSE)","v":{"$error":"#N/A"}},null,null,"Same Individual","","","","","","","","","","",null,"","Yes",null,null,null,"","00-Jan-1900",{"$error":"#VALUE!"},{"$f":"IF('Order Form'!$L$101=\"NGO\",\"\",\" (CDO Pricing); \")","v":" (CDO Pricing); "},{"$f":"IF(#REF!=\"X\",\"Indigo Access;\",\"\")","v":{"$error":"#REF!"}},"","",{"$f":"IF(#REF!=\"\",\"\",\"Subsector: \"&#REF!&\";\")","v":{"$error":"#REF!"}},"No data to provide;",null,""]
[null,null,25,null,null,null,null,null,null,null,null,null,null,null,null,null,null,"",null,null,null,null,null,null,null,null,null,null,null,null,null,null,null,null,null,"",null,null,null,null,null,null,null,null,null,null,null,null,null,null,null,null,null,null,null,null,null,null,null,null,null,null,null,null,0,0,"","","",0,null,null,"",0,"1901-12-31","1902-12-30",null,null,null,null,null,null,null,null,"2021-03-18",0,"","","","","","","","",0,0,{"$f":"VLOOKUP($CR78,SurveyDataContacts,'Survey Contacts'!$L$24,FALSE)","v":{"$error":"#N/A"}},{"$f":"VLOOKUP($CR78,SurveyDataContacts,'Survey Contacts'!$T$24,FALSE)","v":{"$error":"#N/A"}},{"$f":"VLOOKUP($CR78,SurveyDataContacts,'Survey Contacts'!$AL$24,FALSE)","v":{"$error":"#N/A"}},"",{"$f":"VLOOKUP($CR78,SurveyDataContacts,'Survey Contacts'!$BD$24,FALSE)","v":{"$error":"#N/A"}},{"$f":"VLOOKUP($CR78,SurveyDataContacts,'Survey Contacts'!$DS$24,FALSE)","v":{"$error":"#N/A"}},{"$f":"VLOOKUP($CR78,SurveyDataContacts,'Survey Contacts'!$BV$24,FALSE)","v":{"$error":"#N/A"}},{"$f":"VLOOKUP($CR78,SurveyDataContacts,'Survey Contacts'!$CQ$24,FALSE)","v":{"$error":"#N/A"}},{"$f":"VLOOKUP($CR78,SurveyDataContacts,'Survey Contacts'!$DE$24,FALSE)","v":{"$error":"#N/A"}},{"$error":"#N/A"},{"$error":"#N/A"},{"$error":"#N/A"},{"$error":"#N/A"},1900,"0 - 1900",null,"01900",{"$f":"VLOOKUP($D78,HQ_Contacts,'HQ and Regional Contacts'!$Q$24,FALSE)","v":{"$error":"#N/A"}},{"$f":"VLOOKUP($D78,HQ_Contacts,'HQ and Regional Contacts'!$Y$24,FALSE)","v":{"$error":"#N/A"}},{"$f":"VLOOKUP($D78,HQ_Contacts,'HQ and Regional Contacts'!$AQ$24,FALSE)","v":{"$error":"#N/A"}},"",{"$f":"VLOOKUP($D78,HQ_Contacts,'HQ and Regional Contacts'!$BI$24,FALSE)","v":{"$error":"#N/A"}},{"$f":"VLOOKUP($D78,HQ_Contacts,'HQ and Regional Contacts'!$DX$24,FALSE)","v":{"$error":"#N/A"}},{"$f":"VLOOKUP($D78,HQ_Contacts,'HQ and Regional Contacts'!$CA$24,FALSE)","v":{"$error":"#N/A"}},{"$f":"VLOOKUP($D78,HQ_Contacts,'HQ and Regional Contacts'!$CV$24,FALSE)","v":{"$error":"#N/A"}},{"$f":"VLOOKUP($D78,HQ_Contacts,'HQ and Regional Contacts'!$DJ$24,FALSE)","v":{"$error":"#N/A"}},null,null,"Same Individual","","","","","","","","","","",null,"","Yes",null,null,null,"","00-Jan-1900",{"$error":"#VALUE!"},{"$f":"IF('Order Form'!$L$101=\"NGO\",\"\",\" (CDO Pricing); \")","v":" (CDO Pricing); "},{"$f":"IF(#REF!=\"X\",\"Indigo Access;\",\"\")","v":{"$error":"#REF!"}},"","",{"$f":"IF(#REF!=\"\",\"\",\"Subsector: \"&#REF!&\";\")","v":{"$error":"#REF!"}},"No data to provide;",null,""]
[null,null,26,null,null,null,null,null,null,null,null,null,null,null,null,null,null,"",null,null,null,null,null,null,null,null,null,null,null,null,null,null,null,null,null,"",null,null,null,null,null,null,null,null,null,null,null,null,null,null,null,null,null,null,null,null,null,null,null,null,null,null,null,null,0,0,"","","",0,null,null,"",0,"1901-12-31","1902-12-30",null,null,null,null,null,null,null,null,"2021-03-18",0,"","","","","","","","",0,0,{"$f":"VLOOKUP($CR79,SurveyDataContacts,'Survey Contacts'!$L$24,FALSE)","v":{"$error":"#N/A"}},{"$f":"VLOOKUP($CR79,SurveyDataContacts,'Survey Contacts'!$T$24,FALSE)","v":{"$error":"#N/A"}},{"$f":"VLOOKUP($CR79,SurveyDataContacts,'Survey Contacts'!$AL$24,FALSE)","v":{"$error":"#N/A"}},"",{"$f":"VLOOKUP($CR79,SurveyDataContacts,'Survey Contacts'!$BD$24,FALSE)","v":{"$error":"#N/A"}},{"$f":"VLOOKUP($CR79,SurveyDataContacts,'Survey Contacts'!$DS$24,FALSE)","v":{"$error":"#N/A"}},{"$f":"VLOOKUP($CR79,SurveyDataContacts,'Survey Contacts'!$BV$24,FALSE)","v":{"$error":"#N/A"}},{"$f":"VLOOKUP($CR79,SurveyDataContacts,'Survey Contacts'!$CQ$24,FALSE)","v":{"$error":"#N/A"}},{"$f":"VLOOKUP($CR79,SurveyDataContacts,'Survey Contacts'!$DE$24,FALSE)","v":{"$error":"#N/A"}},{"$error":"#N/A"},{"$error":"#N/A"},{"$error":"#N/A"},{"$error":"#N/A"},1900,"0 - 1900",null,"01900",{"$f":"VLOOKUP($D79,HQ_Contacts,'HQ and Regional Contacts'!$Q$24,FALSE)","v":{"$error":"#N/A"}},{"$f":"VLOOKUP($D79,HQ_Contacts,'HQ and Regional Contacts'!$Y$24,FALSE)","v":{"$error":"#N/A"}},{"$f":"VLOOKUP($D79,HQ_Contacts,'HQ and Regional Contacts'!$AQ$24,FALSE)","v":{"$error":"#N/A"}},"",{"$f":"VLOOKUP($D79,HQ_Contacts,'HQ and Regional Contacts'!$BI$24,FALSE)","v":{"$error":"#N/A"}},{"$f":"VLOOKUP($D79,HQ_Contacts,'HQ and Regional Contacts'!$DX$24,FALSE)","v":{"$error":"#N/A"}},{"$f":"VLOOKUP($D79,HQ_Contacts,'HQ and Regional Contacts'!$CA$24,FALSE)","v":{"$error":"#N/A"}},{"$f":"VLOOKUP($D79,HQ_Contacts,'HQ and Regional Contacts'!$CV$24,FALSE)","v":{"$error":"#N/A"}},{"$f":"VLOOKUP($D79,HQ_Contacts,'HQ and Regional Contacts'!$DJ$24,FALSE)","v":{"$error":"#N/A"}},null,null,"Same Individual","","","","","","","","","","",null,"","Yes",null,null,null,"","00-Jan-1900",{"$error":"#VALUE!"},{"$f":"IF('Order Form'!$L$101=\"NGO\",\"\",\" (CDO Pricing); \")","v":" (CDO Pricing); "},{"$f":"IF(#REF!=\"X\",\"Indigo Access;\",\"\")","v":{"$error":"#REF!"}},"","",{"$f":"IF(#REF!=\"\",\"\",\"Subsector: \"&#REF!&\";\")","v":{"$error":"#REF!"}},"No data to provide;",null,""]
[null,null,27,null,null,null,null,null,null,null,null,null,null,null,null,null,null,"",null,null,null,null,null,null,null,null,null,null,null,null,null,null,null,null,null,"",null,null,null,null,null,null,null,null,null,null,null,null,null,null,null,null,null,null,null,null,null,null,null,null,null,null,null,null,0,0,"","","",0,null,null,"",0,"1901-12-31","1902-12-30",null,null,null,null,null,null,null,null,"2021-03-18",0,"","","","","","","","",0,0,{"$f":"VLOOKUP($CR80,SurveyDataContacts,'Survey Contacts'!$L$24,FALSE)","v":{"$error":"#N/A"}},{"$f":"VLOOKUP($CR80,SurveyDataContacts,'Survey Contacts'!$T$24,FALSE)","v":{"$error":"#N/A"}},{"$f":"VLOOKUP($CR80,SurveyDataContacts,'Survey Contacts'!$AL$24,FALSE)","v":{"$error":"#N/A"}},"",{"$f":"VLOOKUP($CR80,SurveyDataContacts,'Survey Contacts'!$BD$24,FALSE)","v":{"$error":"#N/A"}},{"$f":"VLOOKUP($CR80,SurveyDataContacts,'Survey Contacts'!$DS$24,FALSE)","v":{"$error":"#N/A"}},{"$f":"VLOOKUP($CR80,SurveyDataContacts,'Survey Contacts'!$BV$24,FALSE)","v":{"$error":"#N/A"}},{"$f":"VLOOKUP($CR80,SurveyDataContacts,'Survey Contacts'!$CQ$24,FALSE)","v":{"$error":"#N/A"}},{"$f":"VLOOKUP($CR80,SurveyDataContacts,'Survey Contacts'!$DE$24,FALSE)","v":{"$error":"#N/A"}},{"$error":"#N/A"},{"$error":"#N/A"},{"$error":"#N/A"},{"$error":"#N/A"},1900,"0 - 1900",null,"01900",{"$f":"VLOOKUP($D80,HQ_Contacts,'HQ and Regional Contacts'!$Q$24,FALSE)","v":{"$error":"#N/A"}},{"$f":"VLOOKUP($D80,HQ_Contacts,'HQ and Regional Contacts'!$Y$24,FALSE)","v":{"$error":"#N/A"}},{"$f":"VLOOKUP($D80,HQ_Contacts,'HQ and Regional Contacts'!$AQ$24,FALSE)","v":{"$error":"#N/A"}},"",{"$f":"VLOOKUP($D80,HQ_Contacts,'HQ and Regional Contacts'!$BI$24,FALSE)","v":{"$error":"#N/A"}},{"$f":"VLOOKUP($D80,HQ_Contacts,'HQ and Regional Contacts'!$DX$24,FALSE)","v":{"$error":"#N/A"}},{"$f":"VLOOKUP($D80,HQ_Contacts,'HQ and Regional Contacts'!$CA$24,FALSE)","v":{"$error":"#N/A"}},{"$f":"VLOOKUP($D80,HQ_Contacts,'HQ and Regional Contacts'!$CV$24,FALSE)","v":{"$error":"#N/A"}},{"$f":"VLOOKUP($D80,HQ_Contacts,'HQ and Regional Contacts'!$DJ$24,FALSE)","v":{"$error":"#N/A"}},null,null,"Same Individual","","","","","","","","","","",null,"","Yes",null,null,null,"","00-Jan-1900",{"$error":"#VALUE!"},{"$f":"IF('Order Form'!$L$101=\"NGO\",\"\",\" (CDO Pricing); \")","v":" (CDO Pricing); "},{"$f":"IF(#REF!=\"X\",\"Indigo Access;\",\"\")","v":{"$error":"#REF!"}},"","",{"$f":"IF(#REF!=\"\",\"\",\"Subsector: \"&#REF!&\";\")","v":{"$error":"#REF!"}},"No data to provide;",null,""]
[null,null,28,null,null,null,null,null,null,null,null,null,null,null,null,null,null,"",null,null,null,null,null,null,null,null,null,null,null,null,null,null,null,null,null,"",null,null,null,null,null,null,null,null,null,null,null,null,null,null,null,null,null,null,null,null,null,null,null,null,null,null,null,null,0,0,"","","",0,null,null,"",0,"1901-12-31","1902-12-30",null,null,null,null,null,null,null,null,"2021-03-18",0,"","","","","","","","",0,0,{"$f":"VLOOKUP($CR81,SurveyDataContacts,'Survey Contacts'!$L$24,FALSE)","v":{"$error":"#N/A"}},{"$f":"VLOOKUP($CR81,SurveyDataContacts,'Survey Contacts'!$T$24,FALSE)","v":{"$error":"#N/A"}},{"$f":"VLOOKUP($CR81,SurveyDataContacts,'Survey Contacts'!$AL$24,FALSE)","v":{"$error":"#N/A"}},"",{"$f":"VLOOKUP($CR81,SurveyDataContacts,'Survey Contacts'!$BD$24,FALSE)","v":{"$error":"#N/A"}},{"$f":"VLOOKUP($CR81,SurveyDataContacts,'Survey Contacts'!$DS$24,FALSE)","v":{"$error":"#N/A"}},{"$f":"VLOOKUP($CR81,SurveyDataContacts,'Survey Contacts'!$BV$24,FALSE)","v":{"$error":"#N/A"}},{"$f":"VLOOKUP($CR81,SurveyDataContacts,'Survey Contacts'!$CQ$24,FALSE)","v":{"$error":"#N/A"}},{"$f":"VLOOKUP($CR81,SurveyDataContacts,'Survey Contacts'!$DE$24,FALSE)","v":{"$error":"#N/A"}},{"$error":"#N/A"},{"$error":"#N/A"},{"$error":"#N/A"},{"$error":"#N/A"},1900,"0 - 1900",null,"01900",{"$f":"VLOOKUP($D81,HQ_Contacts,'HQ and Regional Contacts'!$Q$24,FALSE)","v":{"$error":"#N/A"}},{"$f":"VLOOKUP($D81,HQ_Contacts,'HQ and Regional Contacts'!$Y$24,FALSE)","v":{"$error":"#N/A"}},{"$f":"VLOOKUP($D81,HQ_Contacts,'HQ and Regional Contacts'!$AQ$24,FALSE)","v":{"$error":"#N/A"}},"",{"$f":"VLOOKUP($D81,HQ_Contacts,'HQ and Regional Contacts'!$BI$24,FALSE)","v":{"$error":"#N/A"}},{"$f":"VLOOKUP($D81,HQ_Contacts,'HQ and Regional Contacts'!$DX$24,FALSE)","v":{"$error":"#N/A"}},{"$f":"VLOOKUP($D81,HQ_Contacts,'HQ and Regional Contacts'!$CA$24,FALSE)","v":{"$error":"#N/A"}},{"$f":"VLOOKUP($D81,HQ_Contacts,'HQ and Regional Contacts'!$CV$24,FALSE)","v":{"$error":"#N/A"}},{"$f":"VLOOKUP($D81,HQ_Contacts,'HQ and Regional Contacts'!$DJ$24,FALSE)","v":{"$error":"#N/A"}},null,null,"Same Individual","","","","","","","","","","",null,"","Yes",null,null,null,"","00-Jan-1900",{"$error":"#VALUE!"},{"$f":"IF('Order Form'!$L$101=\"NGO\",\"\",\" (CDO Pricing); \")","v":" (CDO Pricing); "},{"$f":"IF(#REF!=\"X\",\"Indigo Access;\",\"\")","v":{"$error":"#REF!"}},"","",{"$f":"IF(#REF!=\"\",\"\",\"Subsector: \"&#REF!&\";\")","v":{"$error":"#REF!"}},"No data to provide;",null,""]
[null,null,29,null,null,null,null,null,null,null,null,null,null,null,null,null,null,"",null,null,null,null,null,null,null,null,null,null,null,null,null,null,null,null,null,"",null,null,null,null,null,null,null,null,null,null,null,null,null,null,null,null,null,null,null,null,null,null,null,null,null,null,null,null,0,0,"","","",0,null,null,"",0,"1901-12-31","1902-12-30",null,null,null,null,null,null,null,null,"2021-03-18",0,"","","","","","","","",0,0,{"$f":"VLOOKUP($CR82,SurveyDataContacts,'Survey Contacts'!$L$24,FALSE)","v":{"$error":"#N/A"}},{"$f":"VLOOKUP($CR82,SurveyDataContacts,'Survey Contacts'!$T$24,FALSE)","v":{"$error":"#N/A"}},{"$f":"VLOOKUP($CR82,SurveyDataContacts,'Survey Contacts'!$AL$24,FALSE)","v":{"$error":"#N/A"}},"",{"$f":"VLOOKUP($CR82,SurveyDataContacts,'Survey Contacts'!$BD$24,FALSE)","v":{"$error":"#N/A"}},{"$f":"VLOOKUP($CR82,SurveyDataContacts,'Survey Contacts'!$DS$24,FALSE)","v":{"$error":"#N/A"}},{"$f":"VLOOKUP($CR82,SurveyDataContacts,'Survey Contacts'!$BV$24,FALSE)","v":{"$error":"#N/A"}},{"$f":"VLOOKUP($CR82,SurveyDataContacts,'Survey Contacts'!$CQ$24,FALSE)","v":{"$error":"#N/A"}},{"$f":"VLOOKUP($CR82,SurveyDataContacts,'Survey Contacts'!$DE$24,FALSE)","v":{"$error":"#N/A"}},{"$error":"#N/A"},{"$error":"#N/A"},{"$error":"#N/A"},{"$error":"#N/A"},1900,"0 - 1900",null,"01900",{"$f":"VLOOKUP($D82,HQ_Contacts,'HQ and Regional Contacts'!$Q$24,FALSE)","v":{"$error":"#N/A"}},{"$f":"VLOOKUP($D82,HQ_Contacts,'HQ and Regional Contacts'!$Y$24,FALSE)","v":{"$error":"#N/A"}},{"$f":"VLOOKUP($D82,HQ_Contacts,'HQ and Regional Contacts'!$AQ$24,FALSE)","v":{"$error":"#N/A"}},"",{"$f":"VLOOKUP($D82,HQ_Contacts,'HQ and Regional Contacts'!$BI$24,FALSE)","v":{"$error":"#N/A"}},{"$f":"VLOOKUP($D82,HQ_Contacts,'HQ and Regional Contacts'!$DX$24,FALSE)","v":{"$error":"#N/A"}},{"$f":"VLOOKUP($D82,HQ_Contacts,'HQ and Regional Contacts'!$CA$24,FALSE)","v":{"$error":"#N/A"}},{"$f":"VLOOKUP($D82,HQ_Contacts,'HQ and Regional Contacts'!$CV$24,FALSE)","v":{"$error":"#N/A"}},{"$f":"VLOOKUP($D82,HQ_Contacts,'HQ and Regional Contacts'!$DJ$24,FALSE)","v":{"$error":"#N/A"}},null,null,"Same Individual","","","","","","","","","","",null,"","Yes",null,null,null,"","00-Jan-1900",{"$error":"#VALUE!"},{"$f":"IF('Order Form'!$L$101=\"NGO\",\"\",\" (CDO Pricing); \")","v":" (CDO Pricing); "},{"$f":"IF(#REF!=\"X\",\"Indigo Access;\",\"\")","v":{"$error":"#REF!"}},"","",{"$f":"IF(#REF!=\"\",\"\",\"Subsector: \"&#REF!&\";\")","v":{"$error":"#REF!"}},"No data to provide;",null,""]
[null,null,30,null,null,null,null,null,null,null,null,null,null,null,null,null,null,"",null,null,null,null,null,null,null,null,null,null,null,null,null,null,null,null,null,"",null,null,null,null,null,null,null,null,null,null,null,null,null,null,null,null,null,null,null,null,null,null,null,null,null,null,null,null,0,0,"","","",0,null,null,"",0,"1901-12-31","1902-12-30",null,null,null,null,null,null,null,null,"2021-03-18",0,"","","","","","","","",0,0,{"$f":"VLOOKUP($CR83,SurveyDataContacts,'Survey Contacts'!$L$24,FALSE)","v":{"$error":"#N/A"}},{"$f":"VLOOKUP($CR83,SurveyDataContacts,'Survey Contacts'!$T$24,FALSE)","v":{"$error":"#N/A"}},{"$f":"VLOOKUP($CR83,SurveyDataContacts,'Survey Contacts'!$AL$24,FALSE)","v":{"$error":"#N/A"}},"",{"$f":"VLOOKUP($CR83,SurveyDataContacts,'Survey Contacts'!$BD$24,FALSE)","v":{"$error":"#N/A"}},{"$f":"VLOOKUP($CR83,SurveyDataContacts,'Survey Contacts'!$DS$24,FALSE)","v":{"$error":"#N/A"}},{"$f":"VLOOKUP($CR83,SurveyDataContacts,'Survey Contacts'!$BV$24,FALSE)","v":{"$error":"#N/A"}},{"$f":"VLOOKUP($CR83,SurveyDataContacts,'Survey Contacts'!$CQ$24,FALSE)","v":{"$error":"#N/A"}},{"$f":"VLOOKUP($CR83,SurveyDataContacts,'Survey Contacts'!$DE$24,FALSE)","v":{"$error":"#N/A"}},{"$error":"#N/A"},{"$error":"#N/A"},{"$error":"#N/A"},{"$error":"#N/A"},1900,"0 - 1900",null,"01900",{"$f":"VLOOKUP($D83,HQ_Contacts,'HQ and Regional Contacts'!$Q$24,FALSE)","v":{"$error":"#N/A"}},{"$f":"VLOOKUP($D83,HQ_Contacts,'HQ and Regional Contacts'!$Y$24,FALSE)","v":{"$error":"#N/A"}},{"$f":"VLOOKUP($D83,HQ_Contacts,'HQ and Regional Contacts'!$AQ$24,FALSE)","v":{"$error":"#N/A"}},"",{"$f":"VLOOKUP($D83,HQ_Contacts,'HQ and Regional Contacts'!$BI$24,FALSE)","v":{"$error":"#N/A"}},{"$f":"VLOOKUP($D83,HQ_Contacts,'HQ and Regional Contacts'!$DX$24,FALSE)","v":{"$error":"#N/A"}},{"$f":"VLOOKUP($D83,HQ_Contacts,'HQ and Regional Contacts'!$CA$24,FALSE)","v":{"$error":"#N/A"}},{"$f":"VLOOKUP($D83,HQ_Contacts,'HQ and Regional Contacts'!$CV$24,FALSE)","v":{"$error":"#N/A"}},{"$f":"VLOOKUP($D83,HQ_Contacts,'HQ and Regional Contacts'!$DJ$24,FALSE)","v":{"$error":"#N/A"}},null,null,"Same Individual","","","","","","","","","","",null,"","Yes",null,null,null,"","00-Jan-1900",{"$error":"#VALUE!"},{"$f":"IF('Order Form'!$L$101=\"NGO\",\"\",\" (CDO Pricing); \")","v":" (CDO Pricing); "},{"$f":"IF(#REF!=\"X\",\"Indigo Access;\",\"\")","v":{"$error":"#REF!"}},"","",{"$f":"IF(#REF!=\"\",\"\",\"Subsector: \"&#REF!&\";\")","v":{"$error":"#REF!"}},"No data to provide;",null,""]
[null,null,31,null,null,null,null,null,null,null,null,null,null,null,null,null,null,"",null,null,null,null,null,null,null,null,null,null,null,null,null,null,null,null,null,"",null,null,null,null,null,null,null,null,null,null,null,null,null,null,null,null,null,null,null,null,null,null,null,null,null,null,null,null,0,0,"","","",0,null,null,"",0,"1901-12-31","1902-12-30",null,null,null,null,null,null,null,null,"2021-03-18",0,"","","","","","","","",0,0,{"$f":"VLOOKUP($CR84,SurveyDataContacts,'Survey Contacts'!$L$24,FALSE)","v":{"$error":"#N/A"}},{"$f":"VLOOKUP($CR84,SurveyDataContacts,'Survey Contacts'!$T$24,FALSE)","v":{"$error":"#N/A"}},{"$f":"VLOOKUP($CR84,SurveyDataContacts,'Survey Contacts'!$AL$24,FALSE)","v":{"$error":"#N/A"}},"",{"$f":"VLOOKUP($CR84,SurveyDataContacts,'Survey Contacts'!$BD$24,FALSE)","v":{"$error":"#N/A"}},{"$f":"VLOOKUP($CR84,SurveyDataContacts,'Survey Contacts'!$DS$24,FALSE)","v":{"$error":"#N/A"}},{"$f":"VLOOKUP($CR84,SurveyDataContacts,'Survey Contacts'!$BV$24,FALSE)","v":{"$error":"#N/A"}},{"$f":"VLOOKUP($CR84,SurveyDataContacts,'Survey Contacts'!$CQ$24,FALSE)","v":{"$error":"#N/A"}},{"$f":"VLOOKUP($CR84,SurveyDataContacts,'Survey Contacts'!$DE$24,FALSE)","v":{"$error":"#N/A"}},{"$error":"#N/A"},{"$error":"#N/A"},{"$error":"#N/A"},{"$error":"#N/A"},1900,"0 - 1900",null,"01900",{"$f":"VLOOKUP($D84,HQ_Contacts,'HQ and Regional Contacts'!$Q$24,FALSE)","v":{"$error":"#N/A"}},{"$f":"VLOOKUP($D84,HQ_Contacts,'HQ and Regional Contacts'!$Y$24,FALSE)","v":{"$error":"#N/A"}},{"$f":"VLOOKUP($D84,HQ_Contacts,'HQ and Regional Contacts'!$AQ$24,FALSE)","v":{"$error":"#N/A"}},"",{"$f":"VLOOKUP($D84,HQ_Contacts,'HQ and Regional Contacts'!$BI$24,FALSE)","v":{"$error":"#N/A"}},{"$f":"VLOOKUP($D84,HQ_Contacts,'HQ and Regional Contacts'!$DX$24,FALSE)","v":{"$error":"#N/A"}},{"$f":"VLOOKUP($D84,HQ_Contacts,'HQ and Regional Contacts'!$CA$24,FALSE)","v":{"$error":"#N/A"}},{"$f":"VLOOKUP($D84,HQ_Contacts,'HQ and Regional Contacts'!$CV$24,FALSE)","v":{"$error":"#N/A"}},{"$f":"VLOOKUP($D84,HQ_Contacts,'HQ and Regional Contacts'!$DJ$24,FALSE)","v":{"$error":"#N/A"}},null,null,"Same Individual","","","","","","","","","","",null,"","Yes",null,null,null,"","00-Jan-1900",{"$error":"#VALUE!"},{"$f":"IF('Order Form'!$L$101=\"NGO\",\"\",\" (CDO Pricing); \")","v":" (CDO Pricing); "},{"$f":"IF(#REF!=\"X\",\"Indigo Access;\",\"\")","v":{"$error":"#REF!"}},"","",{"$f":"IF(#REF!=\"\",\"\",\"Subsector: \"&#REF!&\";\")","v":{"$error":"#REF!"}},"No data to provide;",null,""]
[null,null,32,null,null,null,null,null,null,null,null,null,null,null,null,null,null,"",null,null,null,null,null,null,null,null,null,null,null,null,null,null,null,null,null,"",null,null,null,null,null,null,null,null,null,null,null,null,null,null,null,null,null,null,null,null,null,null,null,null,null,null,null,null,0,0,"","","",0,null,null,"",0,"1901-12-31","1902-12-30",null,null,null,null,null,null,null,null,"2021-03-18",0,"","","","","","","","",0,0,{"$f":"VLOOKUP($CR85,SurveyDataContacts,'Survey Contacts'!$L$24,FALSE)","v":{"$error":"#N/A"}},{"$f":"VLOOKUP($CR85,SurveyDataContacts,'Survey Contacts'!$T$24,FALSE)","v":{"$error":"#N/A"}},{"$f":"VLOOKUP($CR85,SurveyDataContacts,'Survey Contacts'!$AL$24,FALSE)","v":{"$error":"#N/A"}},"",{"$f":"VLOOKUP($CR85,SurveyDataContacts,'Survey Contacts'!$BD$24,FALSE)","v":{"$error":"#N/A"}},{"$f":"VLOOKUP($CR85,SurveyDataContacts,'Survey Contacts'!$DS$24,FALSE)","v":{"$error":"#N/A"}},{"$f":"VLOOKUP($CR85,SurveyDataContacts,'Survey Contacts'!$BV$24,FALSE)","v":{"$error":"#N/A"}},{"$f":"VLOOKUP($CR85,SurveyDataContacts,'Survey Contacts'!$CQ$24,FALSE)","v":{"$error":"#N/A"}},{"$f":"VLOOKUP($CR85,SurveyDataContacts,'Survey Contacts'!$DE$24,FALSE)","v":{"$error":"#N/A"}},{"$error":"#N/A"},{"$error":"#N/A"},{"$error":"#N/A"},{"$error":"#N/A"},1900,"0 - 1900",null,"01900",{"$f":"VLOOKUP($D85,HQ_Contacts,'HQ and Regional Contacts'!$Q$24,FALSE)","v":{"$error":"#N/A"}},{"$f":"VLOOKUP($D85,HQ_Contacts,'HQ and Regional Contacts'!$Y$24,FALSE)","v":{"$error":"#N/A"}},{"$f":"VLOOKUP($D85,HQ_Contacts,'HQ and Regional Contacts'!$AQ$24,FALSE)","v":{"$error":"#N/A"}},"",{"$f":"VLOOKUP($D85,HQ_Contacts,'HQ and Regional Contacts'!$BI$24,FALSE)","v":{"$error":"#N/A"}},{"$f":"VLOOKUP($D85,HQ_Contacts,'HQ and Regional Contacts'!$DX$24,FALSE)","v":{"$error":"#N/A"}},{"$f":"VLOOKUP($D85,HQ_Contacts,'HQ and Regional Contacts'!$CA$24,FALSE)","v":{"$error":"#N/A"}},{"$f":"VLOOKUP($D85,HQ_Contacts,'HQ and Regional Contacts'!$CV$24,FALSE)","v":{"$error":"#N/A"}},{"$f":"VLOOKUP($D85,HQ_Contacts,'HQ and Regional Contacts'!$DJ$24,FALSE)","v":{"$error":"#N/A"}},null,null,"Same Individual","","","","","","","","","","",null,"","Yes",null,null,null,"","00-Jan-1900",{"$error":"#VALUE!"},{"$f":"IF('Order Form'!$L$101=\"NGO\",\"\",\" (CDO Pricing); \")","v":" (CDO Pricing); "},{"$f":"IF(#REF!=\"X\",\"Indigo Access;\",\"\")","v":{"$error":"#REF!"}},"","",{"$f":"IF(#REF!=\"\",\"\",\"Subsector: \"&#REF!&\";\")","v":{"$error":"#REF!"}},"No data to provide;",null,""]
[null,null,33,null,null,null,null,null,null,null,null,null,null,null,null,null,null,"",null,null,null,null,null,null,null,null,null,null,null,null,null,null,null,null,null,{"$f":"IFERROR(ROUND(IF(ISBLANK(D86),\"\",IF(M86=\"Yes\",0,NGOSP*0.5)),0),\"\")","v":""},null,null,null,null,null,null,null,null,null,null,null,null,null,null,null,null,null,null,null,null,null,null,null,null,null,null,null,null,0,0,{"$f":"IF(ISBLANK(D86),\"\",D86)","v":""},{"$f":"IF(ISBLANK(D86),\"\",NGOSP)","v":""},{"$f":"IF(ISBLANK(AA86),\"\",AA86)","v":""},{"$f":"IF(AA86=\"All Cycles\",CustomAll,0)+IF(OR(AA86=\"Cycle 1 (Apr)\", AA86=\"Cycle 2 (Jul)\", AA86=\"Cycle 3 (Oct)\"),Custom,0)","v":0},null,null,{"$f":"IF(M86=\"Yes\",\"\",AJ86)","v":""},{"$f":"SUM(BU86,BP86,BR86,BT86)","v":0},{"$f":"IF($CA$48=\"Year 1\",$CB$47,IF($CA$48=\"Year 2\",EDATE($CB$47,12),EDATE($CB$47,24)))","v":"1901-12-31"},"1902-12-30",null,null,null,null,null,null,null,null,"2021-03-18",0,"","","","","","","","",{"$f":"TotalIndigo","v":0},{"$f":"D86","v":0},{"$f":"VLOOKUP($CR86,SurveyDataContacts,'Survey Contacts'!$L$24,FALSE)","v":{"$error":"#N/A"}},{"$f":"VLOOKUP($CR86,SurveyDataContacts,'Survey Contacts'!$T$24,FALSE)","v":{"$error":"#N/A"}},{"$f":"VLOOKUP($CR86,SurveyDataContacts,'Survey Contacts'!$AL$24,FALSE)","v":{"$error":"#N/A"}},"",{"$f":"VLOOKUP($CR86,SurveyDataContacts,'Survey Contacts'!$BD$24,FALSE)","v":{"$error":"#N/A"}},{"$f":"VLOOKUP($CR86,SurveyDataContacts,'Survey Contacts'!$DS$24,FALSE)","v":{"$error":"#N/A"}},{"$f":"VLOOKUP($CR86,SurveyDataContacts,'Survey Contacts'!$BV$24,FALSE)","v":{"$error":"#N/A"}},{"$f":"VLOOKUP($CR86,SurveyDataContacts,'Survey Contacts'!$CQ$24,FALSE)","v":{"$error":"#N/A"}},{"$f":"VLOOKUP($CR86,SurveyDataContacts,'Survey Contacts'!$DE$24,FALSE)","v":{"$error":"#N/A"}},{"$f":"VLOOKUP($CR86,Country_Information_SP,$N$155,FALSE)","v":{"$error":"#N/A"}},{"$error":"#N/A"},{"$f":"VLOOKUP($CR86,Country_Information_SP,$W$155,FALSE)","v":{"$error":"#N/A"}},{"$f":"VLOOKUP($CR86,Country_Information_SP,$AF$155,FALSE)","v":{"$error":"#N/A"}},1900,"0 - 1900",null,"01900",{"$f":"VLOOKUP($D86,HQ_Contacts,'HQ and Regional Contacts'!$Q$24,FALSE)","v":{"$error":"#N/A"}},{"$f":"VLOOKUP($D86,HQ_Contacts,'HQ and Regional Contacts'!$Y$24,FALSE)","v":{"$error":"#N/A"}},{"$f":"VLOOKUP($D86,HQ_Contacts,'HQ and Regional Contacts'!$AQ$24,FALSE)","v":{"$error":"#N/A"}},"",{"$f":"VLOOKUP($D86,HQ_Contacts,'HQ and Regional Contacts'!$BI$24,FALSE)","v":{"$error":"#N/A"}},{"$f":"VLOOKUP($D86,HQ_Contacts,'HQ and Regional Contacts'!$DX$24,FALSE)","v":{"$error":"#N/A"}},{"$f":"VLOOKUP($D86,HQ_Contacts,'HQ and Regional Contacts'!$CA$24,FALSE)","v":{"$error":"#N/A"}},{"$f":"VLOOKUP($D86,HQ_Contacts,'HQ and Regional Contacts'!$CV$24,FALSE)","v":{"$error":"#N/A"}},{"$f":"VLOOKUP($D86,HQ_Contacts,'HQ and Regional Contacts'!$DJ$24,FALSE)","v":{"$error":"#N/A"}},null,null,{"$f":"IF(ISBLANK(BillingSurnames),\"Same Individual\",\"Different Individual\")","v":"Same Individual"},"","","","","","","","","","",null,{"$f":"IF(D86=\"\",\"\",IF(M86=\"Yes\",\"Yes\",\"No\"))","v":""},"Yes",null,null,null,{"$f":"IF(D86=\"\",\"\",\"PP: \")","v":""},"00-Jan-1900",{"$error":"#VALUE!"},{"$f":"IF('Order Form'!$L$101=\"NGO\",\"\",\" (CDO Pricing); \")","v":" (CDO Pricing); "},{"$f":"IF(#REF!=\"X\",\"Indigo Access;\",\"\")","v":{"$error":"#REF!"}},{"$f":"IF(Y86=\"X\",\"MS Add-on;\",\"\")","v":""},{"$f":"IF(AA86=\"\",\"\",\"Custom Cut (\"&AA86&\");\")","v":""},{"$f":"IF(#REF!=\"\",\"\",\"Subsector: \"&#REF!&\";\")","v":{"$error":"#REF!"}},"No data to provide;",null,""]
[null,null,34,null,null,null,null,null,null,null,null,null,null,null,null,null,null,"",null,null,null,null,null,null,null,null,null,null,null,null,null,null,null,null,null,"",null,null,null,null,null,null,null,null,null,null,null,null,null,null,null,null,null,null,null,null,null,null,null,null,null,null,null,null,0,0,"","","",0,null,null,"",0,"1901-12-31","1902-12-30",null,null,null,null,null,null,null,null,"2021-03-18",0,"","","","","","","","",0,0,{"$f":"VLOOKUP($CR87,SurveyDataContacts,'Survey Contacts'!$L$24,FALSE)","v":{"$error":"#N/A"}},{"$f":"VLOOKUP($CR87,SurveyDataContacts,'Survey Contacts'!$T$24,FALSE)","v":{"$error":"#N/A"}},{"$f":"VLOOKUP($CR87,SurveyDataContacts,'Survey Contacts'!$AL$24,FALSE)","v":{"$error":"#N/A"}},"",{"$f":"VLOOKUP($CR87,SurveyDataContacts,'Survey Contacts'!$BD$24,FALSE)","v":{"$error":"#N/A"}},{"$f":"VLOOKUP($CR87,SurveyDataContacts,'Survey Contacts'!$DS$24,FALSE)","v":{"$error":"#N/A"}},{"$f":"VLOOKUP($CR87,SurveyDataContacts,'Survey Contacts'!$BV$24,FALSE)","v":{"$error":"#N/A"}},{"$f":"VLOOKUP($CR87,SurveyDataContacts,'Survey Contacts'!$CQ$24,FALSE)","v":{"$error":"#N/A"}},{"$f":"VLOOKUP($CR87,SurveyDataContacts,'Survey Contacts'!$DE$24,FALSE)","v":{"$error":"#N/A"}},{"$error":"#N/A"},{"$error":"#N/A"},{"$error":"#N/A"},{"$error":"#N/A"},1900,"0 - 1900",null,"01900",{"$f":"VLOOKUP($D87,HQ_Contacts,'HQ and Regional Contacts'!$Q$24,FALSE)","v":{"$error":"#N/A"}},{"$f":"VLOOKUP($D87,HQ_Contacts,'HQ and Regional Contacts'!$Y$24,FALSE)","v":{"$error":"#N/A"}},{"$f":"VLOOKUP($D87,HQ_Contacts,'HQ and Regional Contacts'!$AQ$24,FALSE)","v":{"$error":"#N/A"}},"",{"$f":"VLOOKUP($D87,HQ_Contacts,'HQ and Regional Contacts'!$BI$24,FALSE)","v":{"$error":"#N/A"}},{"$f":"VLOOKUP($D87,HQ_Contacts,'HQ and Regional Contacts'!$DX$24,FALSE)","v":{"$error":"#N/A"}},{"$f":"VLOOKUP($D87,HQ_Contacts,'HQ and Regional Contacts'!$CA$24,FALSE)","v":{"$error":"#N/A"}},{"$f":"VLOOKUP($D87,HQ_Contacts,'HQ and Regional Contacts'!$CV$24,FALSE)","v":{"$error":"#N/A"}},{"$f":"VLOOKUP($D87,HQ_Contacts,'HQ and Regional Contacts'!$DJ$24,FALSE)","v":{"$error":"#N/A"}},null,null,"Same Individual","","","","","","","","","","",null,"","Yes",null,null,null,"","00-Jan-1900",{"$error":"#VALUE!"},{"$f":"IF('Order Form'!$L$101=\"NGO\",\"\",\" (CDO Pricing); \")","v":" (CDO Pricing); "},{"$f":"IF(#REF!=\"X\",\"Indigo Access;\",\"\")","v":{"$error":"#REF!"}},"","",{"$f":"IF(#REF!=\"\",\"\",\"Subsector: \"&#REF!&\";\")","v":{"$error":"#REF!"}},"No data to provide;",null,""]
[null,null,35,null,null,null,null,null,null,null,null,null,null,null,null,null,null,"",null,null,null,null,null,null,null,null,null,null,null,null,null,null,null,null,null,"",null,null,null,null,null,null,null,null,null,null,null,null,null,null,null,null,null,null,null,null,null,null,null,null,null,null,null,null,0,0,"","","",0,null,null,"",0,"1901-12-31","1902-12-30",null,null,null,null,null,null,null,null,"2021-03-18",0,"","","","","","","","",0,0,{"$f":"VLOOKUP($CR88,SurveyDataContacts,'Survey Contacts'!$L$24,FALSE)","v":{"$error":"#N/A"}},{"$f":"VLOOKUP($CR88,SurveyDataContacts,'Survey Contacts'!$T$24,FALSE)","v":{"$error":"#N/A"}},{"$f":"VLOOKUP($CR88,SurveyDataContacts,'Survey Contacts'!$AL$24,FALSE)","v":{"$error":"#N/A"}},"",{"$f":"VLOOKUP($CR88,SurveyDataContacts,'Survey Contacts'!$BD$24,FALSE)","v":{"$error":"#N/A"}},{"$f":"VLOOKUP($CR88,SurveyDataContacts,'Survey Contacts'!$DS$24,FALSE)","v":{"$error":"#N/A"}},{"$f":"VLOOKUP($CR88,SurveyDataContacts,'Survey Contacts'!$BV$24,FALSE)","v":{"$error":"#N/A"}},{"$f":"VLOOKUP($CR88,SurveyDataContacts,'Survey Contacts'!$CQ$24,FALSE)","v":{"$error":"#N/A"}},{"$f":"VLOOKUP($CR88,SurveyDataContacts,'Survey Contacts'!$DE$24,FALSE)","v":{"$error":"#N/A"}},{"$error":"#N/A"},{"$error":"#N/A"},{"$error":"#N/A"},{"$error":"#N/A"},1900,"0 - 1900",null,"01900",{"$f":"VLOOKUP($D88,HQ_Contacts,'HQ and Regional Contacts'!$Q$24,FALSE)","v":{"$error":"#N/A"}},{"$f":"VLOOKUP($D88,HQ_Contacts,'HQ and Regional Contacts'!$Y$24,FALSE)","v":{"$error":"#N/A"}},{"$f":"VLOOKUP($D88,HQ_Contacts,'HQ and Regional Contacts'!$AQ$24,FALSE)","v":{"$error":"#N/A"}},"",{"$f":"VLOOKUP($D88,HQ_Contacts,'HQ and Regional Contacts'!$BI$24,FALSE)","v":{"$error":"#N/A"}},{"$f":"VLOOKUP($D88,HQ_Contacts,'HQ and Regional Contacts'!$DX$24,FALSE)","v":{"$error":"#N/A"}},{"$f":"VLOOKUP($D88,HQ_Contacts,'HQ and Regional Contacts'!$CA$24,FALSE)","v":{"$error":"#N/A"}},{"$f":"VLOOKUP($D88,HQ_Contacts,'HQ and Regional Contacts'!$CV$24,FALSE)","v":{"$error":"#N/A"}},{"$f":"VLOOKUP($D88,HQ_Contacts,'HQ and Regional Contacts'!$DJ$24,FALSE)","v":{"$error":"#N/A"}},null,null,"Same Individual","","","","","","","","","","",null,"","Yes",null,null,null,"","00-Jan-1900",{"$error":"#VALUE!"},{"$f":"IF('Order Form'!$L$101=\"NGO\",\"\",\" (CDO Pricing); \")","v":" (CDO Pricing); "},{"$f":"IF(#REF!=\"X\",\"Indigo Access;\",\"\")","v":{"$error":"#REF!"}},"","",{"$f":"IF(#REF!=\"\",\"\",\"Subsector: \"&#REF!&\";\")","v":{"$error":"#REF!"}},"No data to provide;",null,""]
[null,null,36,null,null,null,null,null,null,null,null,null,null,null,null,null,null,"",null,null,null,null,null,null,null,null,null,null,null,null,null,null,null,null,null,"",null,null,null,null,null,null,null,null,null,null,null,null,null,null,null,null,null,null,null,null,null,null,null,null,null,null,null,null,0,0,"","","",0,null,null,"",0,"1901-12-31","1902-12-30",null,null,null,null,null,null,null,null,"2021-03-18",0,"","","","","","","","",0,0,{"$f":"VLOOKUP($CR89,SurveyDataContacts,'Survey Contacts'!$L$24,FALSE)","v":{"$error":"#N/A"}},{"$f":"VLOOKUP($CR89,SurveyDataContacts,'Survey Contacts'!$T$24,FALSE)","v":{"$error":"#N/A"}},{"$f":"VLOOKUP($CR89,SurveyDataContacts,'Survey Contacts'!$AL$24,FALSE)","v":{"$error":"#N/A"}},"",{"$f":"VLOOKUP($CR89,SurveyDataContacts,'Survey Contacts'!$BD$24,FALSE)","v":{"$error":"#N/A"}},{"$f":"VLOOKUP($CR89,SurveyDataContacts,'Survey Contacts'!$DS$24,FALSE)","v":{"$error":"#N/A"}},{"$f":"VLOOKUP($CR89,SurveyDataContacts,'Survey Contacts'!$BV$24,FALSE)","v":{"$error":"#N/A"}},{"$f":"VLOOKUP($CR89,SurveyDataContacts,'Survey Contacts'!$CQ$24,FALSE)","v":{"$error":"#N/A"}},{"$f":"VLOOKUP($CR89,SurveyDataContacts,'Survey Contacts'!$DE$24,FALSE)","v":{"$error":"#N/A"}},{"$error":"#N/A"},{"$error":"#N/A"},{"$error":"#N/A"},{"$error":"#N/A"},1900,"0 - 1900",null,"01900",{"$f":"VLOOKUP($D89,HQ_Contacts,'HQ and Regional Contacts'!$Q$24,FALSE)","v":{"$error":"#N/A"}},{"$f":"VLOOKUP($D89,HQ_Contacts,'HQ and Regional Contacts'!$Y$24,FALSE)","v":{"$error":"#N/A"}},{"$f":"VLOOKUP($D89,HQ_Contacts,'HQ and Regional Contacts'!$AQ$24,FALSE)","v":{"$error":"#N/A"}},"",{"$f":"VLOOKUP($D89,HQ_Contacts,'HQ and Regional Contacts'!$BI$24,FALSE)","v":{"$error":"#N/A"}},{"$f":"VLOOKUP($D89,HQ_Contacts,'HQ and Regional Contacts'!$DX$24,FALSE)","v":{"$error":"#N/A"}},{"$f":"VLOOKUP($D89,HQ_Contacts,'HQ and Regional Contacts'!$CA$24,FALSE)","v":{"$error":"#N/A"}},{"$f":"VLOOKUP($D89,HQ_Contacts,'HQ and Regional Contacts'!$CV$24,FALSE)","v":{"$error":"#N/A"}},{"$f":"VLOOKUP($D89,HQ_Contacts,'HQ and Regional Contacts'!$DJ$24,FALSE)","v":{"$error":"#N/A"}},null,null,"Same Individual","","","","","","","","","","",null,"","Yes",null,null,null,"","00-Jan-1900",{"$error":"#VALUE!"},{"$f":"IF('Order Form'!$L$101=\"NGO\",\"\",\" (CDO Pricing); \")","v":" (CDO Pricing); "},{"$f":"IF(#REF!=\"X\",\"Indigo Access;\",\"\")","v":{"$error":"#REF!"}},"","",{"$f":"IF(#REF!=\"\",\"\",\"Subsector: \"&#REF!&\";\")","v":{"$error":"#REF!"}},"No data to provide;",null,""]
[null,null,37,null,null,null,null,null,null,null,null,null,null,null,null,null,null,"",null,null,null,null,null,null,null,null,null,null,null,null,null,null,null,null,null,"",null,null,null,null,null,null,null,null,null,null,null,null,null,null,null,null,null,null,null,null,null,null,null,null,null,null,null,null,0,0,"","","",0,null,null,"",0,"1901-12-31","1902-12-30",null,null,null,null,null,null,null,null,"2021-03-18",0,"","","","","","","","",0,0,{"$f":"VLOOKUP($CR90,SurveyDataContacts,'Survey Contacts'!$L$24,FALSE)","v":{"$error":"#N/A"}},{"$f":"VLOOKUP($CR90,SurveyDataContacts,'Survey Contacts'!$T$24,FALSE)","v":{"$error":"#N/A"}},{"$f":"VLOOKUP($CR90,SurveyDataContacts,'Survey Contacts'!$AL$24,FALSE)","v":{"$error":"#N/A"}},"",{"$f":"VLOOKUP($CR90,SurveyDataContacts,'Survey Contacts'!$BD$24,FALSE)","v":{"$error":"#N/A"}},{"$f":"VLOOKUP($CR90,SurveyDataContacts,'Survey Contacts'!$DS$24,FALSE)","v":{"$error":"#N/A"}},{"$f":"VLOOKUP($CR90,SurveyDataContacts,'Survey Contacts'!$BV$24,FALSE)","v":{"$error":"#N/A"}},{"$f":"VLOOKUP($CR90,SurveyDataContacts,'Survey Contacts'!$CQ$24,FALSE)","v":{"$error":"#N/A"}},{"$f":"VLOOKUP($CR90,SurveyDataContacts,'Survey Contacts'!$DE$24,FALSE)","v":{"$error":"#N/A"}},{"$error":"#N/A"},{"$error":"#N/A"},{"$error":"#N/A"},{"$error":"#N/A"},1900,"0 - 1900",null,"01900",{"$f":"VLOOKUP($D90,HQ_Contacts,'HQ and Regional Contacts'!$Q$24,FALSE)","v":{"$error":"#N/A"}},{"$f":"VLOOKUP($D90,HQ_Contacts,'HQ and Regional Contacts'!$Y$24,FALSE)","v":{"$error":"#N/A"}},{"$f":"VLOOKUP($D90,HQ_Contacts,'HQ and Regional Contacts'!$AQ$24,FALSE)","v":{"$error":"#N/A"}},"",{"$f":"VLOOKUP($D90,HQ_Contacts,'HQ and Regional Contacts'!$BI$24,FALSE)","v":{"$error":"#N/A"}},{"$f":"VLOOKUP($D90,HQ_Contacts,'HQ and Regional Contacts'!$DX$24,FALSE)","v":{"$error":"#N/A"}},{"$f":"VLOOKUP($D90,HQ_Contacts,'HQ and Regional Contacts'!$CA$24,FALSE)","v":{"$error":"#N/A"}},{"$f":"VLOOKUP($D90,HQ_Contacts,'HQ and Regional Contacts'!$CV$24,FALSE)","v":{"$error":"#N/A"}},{"$f":"VLOOKUP($D90,HQ_Contacts,'HQ and Regional Contacts'!$DJ$24,FALSE)","v":{"$error":"#N/A"}},null,null,"Same Individual","","","","","","","","","","",null,"","Yes",null,null,null,"","00-Jan-1900",{"$error":"#VALUE!"},{"$f":"IF('Order Form'!$L$101=\"NGO\",\"\",\" (CDO Pricing); \")","v":" (CDO Pricing); "},{"$f":"IF(#REF!=\"X\",\"Indigo Access;\",\"\")","v":{"$error":"#REF!"}},"","",{"$f":"IF(#REF!=\"\",\"\",\"Subsector: \"&#REF!&\";\")","v":{"$error":"#REF!"}},"No data to provide;",null,""]
[null,null,38,null,null,null,null,null,null,null,null,null,null,null,null,null,null,"",null,null,null,null,null,null,null,null,null,null,null,null,null,null,null,null,null,"",null,null,null,null,null,null,null,null,null,null,null,null,null,null,null,null,null,null,null,null,null,null,null,null,null,null,null,null,0,0,"","","",0,null,null,"",0,"1901-12-31","1902-12-30",null,null,null,null,null,null,null,null,"2021-03-18",0,"","","","","","","","",0,0,{"$f":"VLOOKUP($CR91,SurveyDataContacts,'Survey Contacts'!$L$24,FALSE)","v":{"$error":"#N/A"}},{"$f":"VLOOKUP($CR91,SurveyDataContacts,'Survey Contacts'!$T$24,FALSE)","v":{"$error":"#N/A"}},{"$f":"VLOOKUP($CR91,SurveyDataContacts,'Survey Contacts'!$AL$24,FALSE)","v":{"$error":"#N/A"}},"",{"$f":"VLOOKUP($CR91,SurveyDataContacts,'Survey Contacts'!$BD$24,FALSE)","v":{"$error":"#N/A"}},{"$f":"VLOOKUP($CR91,SurveyDataContacts,'Survey Contacts'!$DS$24,FALSE)","v":{"$error":"#N/A"}},{"$f":"VLOOKUP($CR91,SurveyDataContacts,'Survey Contacts'!$BV$24,FALSE)","v":{"$error":"#N/A"}},{"$f":"VLOOKUP($CR91,SurveyDataContacts,'Survey Contacts'!$CQ$24,FALSE)","v":{"$error":"#N/A"}},{"$f":"VLOOKUP($CR91,SurveyDataContacts,'Survey Contacts'!$DE$24,FALSE)","v":{"$error":"#N/A"}},{"$error":"#N/A"},{"$error":"#N/A"},{"$error":"#N/A"},{"$error":"#N/A"},1900,"0 - 1900",null,"01900",{"$f":"VLOOKUP($D91,HQ_Contacts,'HQ and Regional Contacts'!$Q$24,FALSE)","v":{"$error":"#N/A"}},{"$f":"VLOOKUP($D91,HQ_Contacts,'HQ and Regional Contacts'!$Y$24,FALSE)","v":{"$error":"#N/A"}},{"$f":"VLOOKUP($D91,HQ_Contacts,'HQ and Regional Contacts'!$AQ$24,FALSE)","v":{"$error":"#N/A"}},"",{"$f":"VLOOKUP($D91,HQ_Contacts,'HQ and Regional Contacts'!$BI$24,FALSE)","v":{"$error":"#N/A"}},{"$f":"VLOOKUP($D91,HQ_Contacts,'HQ and Regional Contacts'!$DX$24,FALSE)","v":{"$error":"#N/A"}},{"$f":"VLOOKUP($D91,HQ_Contacts,'HQ and Regional Contacts'!$CA$24,FALSE)","v":{"$error":"#N/A"}},{"$f":"VLOOKUP($D91,HQ_Contacts,'HQ and Regional Contacts'!$CV$24,FALSE)","v":{"$error":"#N/A"}},{"$f":"VLOOKUP($D91,HQ_Contacts,'HQ and Regional Contacts'!$DJ$24,FALSE)","v":{"$error":"#N/A"}},null,null,"Same Individual","","","","","","","","","","",null,"","Yes",null,null,null,"","00-Jan-1900",{"$error":"#VALUE!"},{"$f":"IF('Order Form'!$L$101=\"NGO\",\"\",\" (CDO Pricing); \")","v":" (CDO Pricing); "},{"$f":"IF(#REF!=\"X\",\"Indigo Access;\",\"\")","v":{"$error":"#REF!"}},"","",{"$f":"IF(#REF!=\"\",\"\",\"Subsector: \"&#REF!&\";\")","v":{"$error":"#REF!"}},"No data to provide;",null,""]
[null,null,39,null,null,null,null,null,null,null,null,null,null,null,null,null,null,"",null,null,null,null,null,null,null,null,null,null,null,null,null,null,null,null,null,"",null,null,null,null,null,null,null,null,null,null,null,null,null,null,null,null,null,null,null,null,null,null,null,null,null,null,null,null,0,0,"","","",0,null,null,"",0,"1901-12-31","1902-12-30",null,null,null,null,null,null,null,null,"2021-03-18",0,"","","","","","","","",0,0,{"$f":"VLOOKUP($CR92,SurveyDataContacts,'Survey Contacts'!$L$24,FALSE)","v":{"$error":"#N/A"}},{"$f":"VLOOKUP($CR92,SurveyDataContacts,'Survey Contacts'!$T$24,FALSE)","v":{"$error":"#N/A"}},{"$f":"VLOOKUP($CR92,SurveyDataContacts,'Survey Contacts'!$AL$24,FALSE)","v":{"$error":"#N/A"}},"",{"$f":"VLOOKUP($CR92,SurveyDataContacts,'Survey Contacts'!$BD$24,FALSE)","v":{"$error":"#N/A"}},{"$f":"VLOOKUP($CR92,SurveyDataContacts,'Survey Contacts'!$DS$24,FALSE)","v":{"$error":"#N/A"}},{"$f":"VLOOKUP($CR92,SurveyDataContacts,'Survey Contacts'!$BV$24,FALSE)","v":{"$error":"#N/A"}},{"$f":"VLOOKUP($CR92,SurveyDataContacts,'Survey Contacts'!$CQ$24,FALSE)","v":{"$error":"#N/A"}},{"$f":"VLOOKUP($CR92,SurveyDataContacts,'Survey Contacts'!$DE$24,FALSE)","v":{"$error":"#N/A"}},{"$error":"#N/A"},{"$error":"#N/A"},{"$error":"#N/A"},{"$error":"#N/A"},1900,"0 - 1900",null,"01900",{"$f":"VLOOKUP($D92,HQ_Contacts,'HQ and Regional Contacts'!$Q$24,FALSE)","v":{"$error":"#N/A"}},{"$f":"VLOOKUP($D92,HQ_Contacts,'HQ and Regional Contacts'!$Y$24,FALSE)","v":{"$error":"#N/A"}},{"$f":"VLOOKUP($D92,HQ_Contacts,'HQ and Regional Contacts'!$AQ$24,FALSE)","v":{"$error":"#N/A"}},"",{"$f":"VLOOKUP($D92,HQ_Contacts,'HQ and Regional Contacts'!$BI$24,FALSE)","v":{"$error":"#N/A"}},{"$f":"VLOOKUP($D92,HQ_Contacts,'HQ and Regional Contacts'!$DX$24,FALSE)","v":{"$error":"#N/A"}},{"$f":"VLOOKUP($D92,HQ_Contacts,'HQ and Regional Contacts'!$CA$24,FALSE)","v":{"$error":"#N/A"}},{"$f":"VLOOKUP($D92,HQ_Contacts,'HQ and Regional Contacts'!$CV$24,FALSE)","v":{"$error":"#N/A"}},{"$f":"VLOOKUP($D92,HQ_Contacts,'HQ and Regional Contacts'!$DJ$24,FALSE)","v":{"$error":"#N/A"}},null,null,"Same Individual","","","","","","","","","","",null,"","Yes",null,null,null,"","00-Jan-1900",{"$error":"#VALUE!"},{"$f":"IF('Order Form'!$L$101=\"NGO\",\"\",\" (CDO Pricing); \")","v":" (CDO Pricing); "},{"$f":"IF(#REF!=\"X\",\"Indigo Access;\",\"\")","v":{"$error":"#REF!"}},"","",{"$f":"IF(#REF!=\"\",\"\",\"Subsector: \"&#REF!&\";\")","v":{"$error":"#REF!"}},"No data to provide;",null,""]
[null,null,40,null,null,null,null,null,null,null,null,null,null,null,null,null,null,"",null,null,null,null,null,null,null,null,null,null,null,null,null,null,null,null,null,"",null,null,null,null,null,null,null,null,null,null,null,null,null,null,null,null,null,null,null,null,null,null,null,null,null,null,null,null,0,0,"","","",0,null,null,"",0,"1901-12-31","1902-12-30",null,null,null,null,null,null,null,null,"2021-03-18",0,"","","","","","","","",0,0,{"$f":"VLOOKUP($CR93,SurveyDataContacts,'Survey Contacts'!$L$24,FALSE)","v":{"$error":"#N/A"}},{"$f":"VLOOKUP($CR93,SurveyDataContacts,'Survey Contacts'!$T$24,FALSE)","v":{"$error":"#N/A"}},{"$f":"VLOOKUP($CR93,SurveyDataContacts,'Survey Contacts'!$AL$24,FALSE)","v":{"$error":"#N/A"}},"",{"$f":"VLOOKUP($CR93,SurveyDataContacts,'Survey Contacts'!$BD$24,FALSE)","v":{"$error":"#N/A"}},{"$f":"VLOOKUP($CR93,SurveyDataContacts,'Survey Contacts'!$DS$24,FALSE)","v":{"$error":"#N/A"}},{"$f":"VLOOKUP($CR93,SurveyDataContacts,'Survey Contacts'!$BV$24,FALSE)","v":{"$error":"#N/A"}},{"$f":"VLOOKUP($CR93,SurveyDataContacts,'Survey Contacts'!$CQ$24,FALSE)","v":{"$error":"#N/A"}},{"$f":"VLOOKUP($CR93,SurveyDataContacts,'Survey Contacts'!$DE$24,FALSE)","v":{"$error":"#N/A"}},{"$error":"#N/A"},{"$error":"#N/A"},{"$error":"#N/A"},{"$error":"#N/A"},1900,"0 - 1900",null,"01900",{"$f":"VLOOKUP($D93,HQ_Contacts,'HQ and Regional Contacts'!$Q$24,FALSE)","v":{"$error":"#N/A"}},{"$f":"VLOOKUP($D93,HQ_Contacts,'HQ and Regional Contacts'!$Y$24,FALSE)","v":{"$error":"#N/A"}},{"$f":"VLOOKUP($D93,HQ_Contacts,'HQ and Regional Contacts'!$AQ$24,FALSE)","v":{"$error":"#N/A"}},"",{"$f":"VLOOKUP($D93,HQ_Contacts,'HQ and Regional Contacts'!$BI$24,FALSE)","v":{"$error":"#N/A"}},{"$f":"VLOOKUP($D93,HQ_Contacts,'HQ and Regional Contacts'!$DX$24,FALSE)","v":{"$error":"#N/A"}},{"$f":"VLOOKUP($D93,HQ_Contacts,'HQ and Regional Contacts'!$CA$24,FALSE)","v":{"$error":"#N/A"}},{"$f":"VLOOKUP($D93,HQ_Contacts,'HQ and Regional Contacts'!$CV$24,FALSE)","v":{"$error":"#N/A"}},{"$f":"VLOOKUP($D93,HQ_Contacts,'HQ and Regional Contacts'!$DJ$24,FALSE)","v":{"$error":"#N/A"}},null,null,"Same Individual","","","","","","","","","","",null,"","Yes",null,null,null,"","00-Jan-1900",{"$error":"#VALUE!"},{"$f":"IF('Order Form'!$L$101=\"NGO\",\"\",\" (CDO Pricing); \")","v":" (CDO Pricing); "},{"$f":"IF(#REF!=\"X\",\"Indigo Access;\",\"\")","v":{"$error":"#REF!"}},"","",{"$f":"IF(#REF!=\"\",\"\",\"Subsector: \"&#REF!&\";\")","v":{"$error":"#REF!"}},"No data to provide;",null,""]
[null,null,41,null,null,null,null,null,null,null,null,null,null,null,null,null,null,"",null,null,null,null,null,null,null,null,null,null,null,null,null,null,null,null,null,"",null,null,null,null,null,null,null,null,null,null,null,null,null,null,null,null,null,null,null,null,null,null,null,null,null,null,null,null,0,0,"","","",0,null,null,"",0,"1901-12-31","1902-12-30",null,null,null,null,null,null,null,null,"2021-03-18",0,"","","","","","","","",0,0,{"$f":"VLOOKUP($CR94,SurveyDataContacts,'Survey Contacts'!$L$24,FALSE)","v":{"$error":"#N/A"}},{"$f":"VLOOKUP($CR94,SurveyDataContacts,'Survey Contacts'!$T$24,FALSE)","v":{"$error":"#N/A"}},{"$f":"VLOOKUP($CR94,SurveyDataContacts,'Survey Contacts'!$AL$24,FALSE)","v":{"$error":"#N/A"}},"",{"$f":"VLOOKUP($CR94,SurveyDataContacts,'Survey Contacts'!$BD$24,FALSE)","v":{"$error":"#N/A"}},{"$f":"VLOOKUP($CR94,SurveyDataContacts,'Survey Contacts'!$DS$24,FALSE)","v":{"$error":"#N/A"}},{"$f":"VLOOKUP($CR94,SurveyDataContacts,'Survey Contacts'!$BV$24,FALSE)","v":{"$error":"#N/A"}},{"$f":"VLOOKUP($CR94,SurveyDataContacts,'Survey Contacts'!$CQ$24,FALSE)","v":{"$error":"#N/A"}},{"$f":"VLOOKUP($CR94,SurveyDataContacts,'Survey Contacts'!$DE$24,FALSE)","v":{"$error":"#N/A"}},{"$error":"#N/A"},{"$error":"#N/A"},{"$error":"#N/A"},{"$error":"#N/A"},1900,"0 - 1900",null,"01900",{"$f":"VLOOKUP($D94,HQ_Contacts,'HQ and Regional Contacts'!$Q$24,FALSE)","v":{"$error":"#N/A"}},{"$f":"VLOOKUP($D94,HQ_Contacts,'HQ and Regional Contacts'!$Y$24,FALSE)","v":{"$error":"#N/A"}},{"$f":"VLOOKUP($D94,HQ_Contacts,'HQ and Regional Contacts'!$AQ$24,FALSE)","v":{"$error":"#N/A"}},"",{"$f":"VLOOKUP($D94,HQ_Contacts,'HQ and Regional Contacts'!$BI$24,FALSE)","v":{"$error":"#N/A"}},{"$f":"VLOOKUP($D94,HQ_Contacts,'HQ and Regional Contacts'!$DX$24,FALSE)","v":{"$error":"#N/A"}},{"$f":"VLOOKUP($D94,HQ_Contacts,'HQ and Regional Contacts'!$CA$24,FALSE)","v":{"$error":"#N/A"}},{"$f":"VLOOKUP($D94,HQ_Contacts,'HQ and Regional Contacts'!$CV$24,FALSE)","v":{"$error":"#N/A"}},{"$f":"VLOOKUP($D94,HQ_Contacts,'HQ and Regional Contacts'!$DJ$24,FALSE)","v":{"$error":"#N/A"}},null,null,"Same Individual","","","","","","","","","","",null,"","Yes",null,null,null,"","00-Jan-1900",{"$error":"#VALUE!"},{"$f":"IF('Order Form'!$L$101=\"NGO\",\"\",\" (CDO Pricing); \")","v":" (CDO Pricing); "},{"$f":"IF(#REF!=\"X\",\"Indigo Access;\",\"\")","v":{"$error":"#REF!"}},"","",{"$f":"IF(#REF!=\"\",\"\",\"Subsector: \"&#REF!&\";\")","v":{"$error":"#REF!"}},"No data to provide;",null,""]
[null,null,42,null,null,null,null,null,null,null,null,null,null,null,null,null,null,"",null,null,null,null,null,null,null,null,null,null,null,null,null,null,null,null,null,"",null,null,null,null,null,null,null,null,null,null,null,null,null,null,null,null,null,null,null,null,null,null,null,null,null,null,null,null,0,0,"","","",0,null,null,"",0,"1901-12-31","1902-12-30",null,null,null,null,null,null,null,null,"2021-03-18",0,"","","","","","","","",0,0,{"$f":"VLOOKUP($CR95,SurveyDataContacts,'Survey Contacts'!$L$24,FALSE)","v":{"$error":"#N/A"}},{"$f":"VLOOKUP($CR95,SurveyDataContacts,'Survey Contacts'!$T$24,FALSE)","v":{"$error":"#N/A"}},{"$f":"VLOOKUP($CR95,SurveyDataContacts,'Survey Contacts'!$AL$24,FALSE)","v":{"$error":"#N/A"}},"",{"$f":"VLOOKUP($CR95,SurveyDataContacts,'Survey Contacts'!$BD$24,FALSE)","v":{"$error":"#N/A"}},{"$f":"VLOOKUP($CR95,SurveyDataContacts,'Survey Contacts'!$DS$24,FALSE)","v":{"$error":"#N/A"}},{"$f":"VLOOKUP($CR95,SurveyDataContacts,'Survey Contacts'!$BV$24,FALSE)","v":{"$error":"#N/A"}},{"$f":"VLOOKUP($CR95,SurveyDataContacts,'Survey Contacts'!$CQ$24,FALSE)","v":{"$error":"#N/A"}},{"$f":"VLOOKUP($CR95,SurveyDataContacts,'Survey Contacts'!$DE$24,FALSE)","v":{"$error":"#N/A"}},{"$error":"#N/A"},{"$error":"#N/A"},{"$error":"#N/A"},{"$error":"#N/A"},1900,"0 - 1900",null,"01900",{"$f":"VLOOKUP($D95,HQ_Contacts,'HQ and Regional Contacts'!$Q$24,FALSE)","v":{"$error":"#N/A"}},{"$f":"VLOOKUP($D95,HQ_Contacts,'HQ and Regional Contacts'!$Y$24,FALSE)","v":{"$error":"#N/A"}},{"$f":"VLOOKUP($D95,HQ_Contacts,'HQ and Regional Contacts'!$AQ$24,FALSE)","v":{"$error":"#N/A"}},"",{"$f":"VLOOKUP($D95,HQ_Contacts,'HQ and Regional Contacts'!$BI$24,FALSE)","v":{"$error":"#N/A"}},{"$f":"VLOOKUP($D95,HQ_Contacts,'HQ and Regional Contacts'!$DX$24,FALSE)","v":{"$error":"#N/A"}},{"$f":"VLOOKUP($D95,HQ_Contacts,'HQ and Regional Contacts'!$CA$24,FALSE)","v":{"$error":"#N/A"}},{"$f":"VLOOKUP($D95,HQ_Contacts,'HQ and Regional Contacts'!$CV$24,FALSE)","v":{"$error":"#N/A"}},{"$f":"VLOOKUP($D95,HQ_Contacts,'HQ and Regional Contacts'!$DJ$24,FALSE)","v":{"$error":"#N/A"}},null,null,"Same Individual","","","","","","","","","","",null,"","Yes",null,null,null,"","00-Jan-1900",{"$error":"#VALUE!"},{"$f":"IF('Order Form'!$L$101=\"NGO\",\"\",\" (CDO Pricing); \")","v":" (CDO Pricing); "},{"$f":"IF(#REF!=\"X\",\"Indigo Access;\",\"\")","v":{"$error":"#REF!"}},"","",{"$f":"IF(#REF!=\"\",\"\",\"Subsector: \"&#REF!&\";\")","v":{"$error":"#REF!"}},"No data to provide;",null,""]
[null,null,43,null,null,null,null,null,null,null,null,null,null,null,null,null,null,"",null,null,null,null,null,null,null,null,null,null,null,null,null,null,null,null,null,"",null,null,null,null,null,null,null,null,null,null,null,null,null,null,null,null,null,null,null,null,null,null,null,null,null,null,null,null,0,0,"","","",0,null,null,"",0,"1901-12-31","1902-12-30",null,null,null,null,null,null,null,null,"2021-03-18",0,"","","","","","","","",0,0,{"$f":"VLOOKUP($CR96,SurveyDataContacts,'Survey Contacts'!$L$24,FALSE)","v":{"$error":"#N/A"}},{"$f":"VLOOKUP($CR96,SurveyDataContacts,'Survey Contacts'!$T$24,FALSE)","v":{"$error":"#N/A"}},{"$f":"VLOOKUP($CR96,SurveyDataContacts,'Survey Contacts'!$AL$24,FALSE)","v":{"$error":"#N/A"}},"",{"$f":"VLOOKUP($CR96,SurveyDataContacts,'Survey Contacts'!$BD$24,FALSE)","v":{"$error":"#N/A"}},{"$f":"VLOOKUP($CR96,SurveyDataContacts,'Survey Contacts'!$DS$24,FALSE)","v":{"$error":"#N/A"}},{"$f":"VLOOKUP($CR96,SurveyDataContacts,'Survey Contacts'!$BV$24,FALSE)","v":{"$error":"#N/A"}},{"$f":"VLOOKUP($CR96,SurveyDataContacts,'Survey Contacts'!$CQ$24,FALSE)","v":{"$error":"#N/A"}},{"$f":"VLOOKUP($CR96,SurveyDataContacts,'Survey Contacts'!$DE$24,FALSE)","v":{"$error":"#N/A"}},{"$error":"#N/A"},{"$error":"#N/A"},{"$error":"#N/A"},{"$error":"#N/A"},1900,"0 - 1900",null,"01900",{"$f":"VLOOKUP($D96,HQ_Contacts,'HQ and Regional Contacts'!$Q$24,FALSE)","v":{"$error":"#N/A"}},{"$f":"VLOOKUP($D96,HQ_Contacts,'HQ and Regional Contacts'!$Y$24,FALSE)","v":{"$error":"#N/A"}},{"$f":"VLOOKUP($D96,HQ_Contacts,'HQ and Regional Contacts'!$AQ$24,FALSE)","v":{"$error":"#N/A"}},"",{"$f":"VLOOKUP($D96,HQ_Contacts,'HQ and Regional Contacts'!$BI$24,FALSE)","v":{"$error":"#N/A"}},{"$f":"VLOOKUP($D96,HQ_Contacts,'HQ and Regional Contacts'!$DX$24,FALSE)","v":{"$error":"#N/A"}},{"$f":"VLOOKUP($D96,HQ_Contacts,'HQ and Regional Contacts'!$CA$24,FALSE)","v":{"$error":"#N/A"}},{"$f":"VLOOKUP($D96,HQ_Contacts,'HQ and Regional Contacts'!$CV$24,FALSE)","v":{"$error":"#N/A"}},{"$f":"VLOOKUP($D96,HQ_Contacts,'HQ and Regional Contacts'!$DJ$24,FALSE)","v":{"$error":"#N/A"}},null,null,"Same Individual","","","","","","","","","","",null,"","Yes",null,null,null,"","00-Jan-1900",{"$error":"#VALUE!"},{"$f":"IF('Order Form'!$L$101=\"NGO\",\"\",\" (CDO Pricing); \")","v":" (CDO Pricing); "},{"$f":"IF(#REF!=\"X\",\"Indigo Access;\",\"\")","v":{"$error":"#REF!"}},"","",{"$f":"IF(#REF!=\"\",\"\",\"Subsector: \"&#REF!&\";\")","v":{"$error":"#REF!"}},"No data to provide;",null,""]
[null,null,44,null,null,null,null,null,null,null,null,null,null,null,null,null,null,"",null,null,null,null,null,null,null,null,null,null,null,null,null,null,null,null,null,"",null,null,null,null,null,null,null,null,null,null,null,null,null,null,null,null,null,null,null,null,null,null,null,null,null,null,null,null,0,0,"","","",0,null,null,"",0,"1901-12-31","1902-12-30",null,null,null,null,null,null,null,null,"2021-03-18",0,"","","","","","","","",0,0,{"$f":"VLOOKUP($CR97,SurveyDataContacts,'Survey Contacts'!$L$24,FALSE)","v":{"$error":"#N/A"}},{"$f":"VLOOKUP($CR97,SurveyDataContacts,'Survey Contacts'!$T$24,FALSE)","v":{"$error":"#N/A"}},{"$f":"VLOOKUP($CR97,SurveyDataContacts,'Survey Contacts'!$AL$24,FALSE)","v":{"$error":"#N/A"}},"",{"$f":"VLOOKUP($CR97,SurveyDataContacts,'Survey Contacts'!$BD$24,FALSE)","v":{"$error":"#N/A"}},{"$f":"VLOOKUP($CR97,SurveyDataContacts,'Survey Contacts'!$DS$24,FALSE)","v":{"$error":"#N/A"}},{"$f":"VLOOKUP($CR97,SurveyDataContacts,'Survey Contacts'!$BV$24,FALSE)","v":{"$error":"#N/A"}},{"$f":"VLOOKUP($CR97,SurveyDataContacts,'Survey Contacts'!$CQ$24,FALSE)","v":{"$error":"#N/A"}},{"$f":"VLOOKUP($CR97,SurveyDataContacts,'Survey Contacts'!$DE$24,FALSE)","v":{"$error":"#N/A"}},{"$error":"#N/A"},{"$error":"#N/A"},{"$error":"#N/A"},{"$error":"#N/A"},1900,"0 - 1900",null,"01900",{"$f":"VLOOKUP($D97,HQ_Contacts,'HQ and Regional Contacts'!$Q$24,FALSE)","v":{"$error":"#N/A"}},{"$f":"VLOOKUP($D97,HQ_Contacts,'HQ and Regional Contacts'!$Y$24,FALSE)","v":{"$error":"#N/A"}},{"$f":"VLOOKUP($D97,HQ_Contacts,'HQ and Regional Contacts'!$AQ$24,FALSE)","v":{"$error":"#N/A"}},"",{"$f":"VLOOKUP($D97,HQ_Contacts,'HQ and Regional Contacts'!$BI$24,FALSE)","v":{"$error":"#N/A"}},{"$f":"VLOOKUP($D97,HQ_Contacts,'HQ and Regional Contacts'!$DX$24,FALSE)","v":{"$error":"#N/A"}},{"$f":"VLOOKUP($D97,HQ_Contacts,'HQ and Regional Contacts'!$CA$24,FALSE)","v":{"$error":"#N/A"}},{"$f":"VLOOKUP($D97,HQ_Contacts,'HQ and Regional Contacts'!$CV$24,FALSE)","v":{"$error":"#N/A"}},{"$f":"VLOOKUP($D97,HQ_Contacts,'HQ and Regional Contacts'!$DJ$24,FALSE)","v":{"$error":"#N/A"}},null,null,"Same Individual","","","","","","","","","","",null,"","Yes",null,null,null,"","00-Jan-1900",{"$error":"#VALUE!"},{"$f":"IF('Order Form'!$L$101=\"NGO\",\"\",\" (CDO Pricing); \")","v":" (CDO Pricing); "},{"$f":"IF(#REF!=\"X\",\"Indigo Access;\",\"\")","v":{"$error":"#REF!"}},"","",{"$f":"IF(#REF!=\"\",\"\",\"Subsector: \"&#REF!&\";\")","v":{"$error":"#REF!"}},"No data to provide;",null,""]
[null,null,45,null,null,null,null,null,null,null,null,null,null,null,null,null,null,"",null,null,null,null,null,null,null,null,null,null,null,null,null,null,null,null,null,"",null,null,null,null,null,null,null,null,null,null,null,null,null,null,null,null,null,null,null,null,null,null,null,null,null,null,null,null,0,0,"","","",0,null,null,"",0,"1901-12-31","1902-12-30",null,null,null,null,null,null,null,null,"2021-03-18",0,"","","","","","","","",0,0,{"$f":"VLOOKUP($CR98,SurveyDataContacts,'Survey Contacts'!$L$24,FALSE)","v":{"$error":"#N/A"}},{"$f":"VLOOKUP($CR98,SurveyDataContacts,'Survey Contacts'!$T$24,FALSE)","v":{"$error":"#N/A"}},{"$f":"VLOOKUP($CR98,SurveyDataContacts,'Survey Contacts'!$AL$24,FALSE)","v":{"$error":"#N/A"}},"",{"$f":"VLOOKUP($CR98,SurveyDataContacts,'Survey Contacts'!$BD$24,FALSE)","v":{"$error":"#N/A"}},{"$f":"VLOOKUP($CR98,SurveyDataContacts,'Survey Contacts'!$DS$24,FALSE)","v":{"$error":"#N/A"}},{"$f":"VLOOKUP($CR98,SurveyDataContacts,'Survey Contacts'!$BV$24,FALSE)","v":{"$error":"#N/A"}},{"$f":"VLOOKUP($CR98,SurveyDataContacts,'Survey Contacts'!$CQ$24,FALSE)","v":{"$error":"#N/A"}},{"$f":"VLOOKUP($CR98,SurveyDataContacts,'Survey Contacts'!$DE$24,FALSE)","v":{"$error":"#N/A"}},{"$error":"#N/A"},{"$error":"#N/A"},{"$error":"#N/A"},{"$error":"#N/A"},1900,"0 - 1900",null,"01900",{"$f":"VLOOKUP($D98,HQ_Contacts,'HQ and Regional Contacts'!$Q$24,FALSE)","v":{"$error":"#N/A"}},{"$f":"VLOOKUP($D98,HQ_Contacts,'HQ and Regional Contacts'!$Y$24,FALSE)","v":{"$error":"#N/A"}},{"$f":"VLOOKUP($D98,HQ_Contacts,'HQ and Regional Contacts'!$AQ$24,FALSE)","v":{"$error":"#N/A"}},"",{"$f":"VLOOKUP($D98,HQ_Contacts,'HQ and Regional Contacts'!$BI$24,FALSE)","v":{"$error":"#N/A"}},{"$f":"VLOOKUP($D98,HQ_Contacts,'HQ and Regional Contacts'!$DX$24,FALSE)","v":{"$error":"#N/A"}},{"$f":"VLOOKUP($D98,HQ_Contacts,'HQ and Regional Contacts'!$CA$24,FALSE)","v":{"$error":"#N/A"}},{"$f":"VLOOKUP($D98,HQ_Contacts,'HQ and Regional Contacts'!$CV$24,FALSE)","v":{"$error":"#N/A"}},{"$f":"VLOOKUP($D98,HQ_Contacts,'HQ and Regional Contacts'!$DJ$24,FALSE)","v":{"$error":"#N/A"}},null,null,"Same Individual","","","","","","","","","","",null,"","Yes",null,null,null,"","00-Jan-1900",{"$error":"#VALUE!"},{"$f":"IF('Order Form'!$L$101=\"NGO\",\"\",\" (CDO Pricing); \")","v":" (CDO Pricing); "},{"$f":"IF(#REF!=\"X\",\"Indigo Access;\",\"\")","v":{"$error":"#REF!"}},"","",{"$f":"IF(#REF!=\"\",\"\",\"Subsector: \"&#REF!&\";\")","v":{"$error":"#REF!"}},"No data to provide;",null,""]
[null,null,46,null,null,null,null,null,null,null,null,null,null,null,null,null,null,"",null,null,null,null,null,null,null,null,null,null,null,null,null,null,null,null,null,"",null,null,null,null,null,null,null,null,null,null,null,null,null,null,null,null,null,null,null,null,null,null,null,null,null,null,null,null,0,0,"","","",0,null,null,"",0,"1901-12-31","1902-12-30",null,null,null,null,null,null,null,null,"2021-03-18",0,"","","","","","","","",0,0,{"$f":"VLOOKUP($CR99,SurveyDataContacts,'Survey Contacts'!$L$24,FALSE)","v":{"$error":"#N/A"}},{"$f":"VLOOKUP($CR99,SurveyDataContacts,'Survey Contacts'!$T$24,FALSE)","v":{"$error":"#N/A"}},{"$f":"VLOOKUP($CR99,SurveyDataContacts,'Survey Contacts'!$AL$24,FALSE)","v":{"$error":"#N/A"}},"",{"$f":"VLOOKUP($CR99,SurveyDataContacts,'Survey Contacts'!$BD$24,FALSE)","v":{"$error":"#N/A"}},{"$f":"VLOOKUP($CR99,SurveyDataContacts,'Survey Contacts'!$DS$24,FALSE)","v":{"$error":"#N/A"}},{"$f":"VLOOKUP($CR99,SurveyDataContacts,'Survey Contacts'!$BV$24,FALSE)","v":{"$error":"#N/A"}},{"$f":"VLOOKUP($CR99,SurveyDataContacts,'Survey Contacts'!$CQ$24,FALSE)","v":{"$error":"#N/A"}},{"$f":"VLOOKUP($CR99,SurveyDataContacts,'Survey Contacts'!$DE$24,FALSE)","v":{"$error":"#N/A"}},{"$error":"#N/A"},{"$error":"#N/A"},{"$error":"#N/A"},{"$error":"#N/A"},1900,"0 - 1900",null,"01900",{"$f":"VLOOKUP($D99,HQ_Contacts,'HQ and Regional Contacts'!$Q$24,FALSE)","v":{"$error":"#N/A"}},{"$f":"VLOOKUP($D99,HQ_Contacts,'HQ and Regional Contacts'!$Y$24,FALSE)","v":{"$error":"#N/A"}},{"$f":"VLOOKUP($D99,HQ_Contacts,'HQ and Regional Contacts'!$AQ$24,FALSE)","v":{"$error":"#N/A"}},"",{"$f":"VLOOKUP($D99,HQ_Contacts,'HQ and Regional Contacts'!$BI$24,FALSE)","v":{"$error":"#N/A"}},{"$f":"VLOOKUP($D99,HQ_Contacts,'HQ and Regional Contacts'!$DX$24,FALSE)","v":{"$error":"#N/A"}},{"$f":"VLOOKUP($D99,HQ_Contacts,'HQ and Regional Contacts'!$CA$24,FALSE)","v":{"$error":"#N/A"}},{"$f":"VLOOKUP($D99,HQ_Contacts,'HQ and Regional Contacts'!$CV$24,FALSE)","v":{"$error":"#N/A"}},{"$f":"VLOOKUP($D99,HQ_Contacts,'HQ and Regional Contacts'!$DJ$24,FALSE)","v":{"$error":"#N/A"}},null,null,"Same Individual","","","","","","","","","","",null,"","Yes",null,null,null,"","00-Jan-1900",{"$error":"#VALUE!"},{"$f":"IF('Order Form'!$L$101=\"NGO\",\"\",\" (CDO Pricing); \")","v":" (CDO Pricing); "},{"$f":"IF(#REF!=\"X\",\"Indigo Access;\",\"\")","v":{"$error":"#REF!"}},"","",{"$f":"IF(#REF!=\"\",\"\",\"Subsector: \"&#REF!&\";\")","v":{"$error":"#REF!"}},"No data to provide;",null,""]
[null,null,47,null,null,null,null,null,null,null,null,null,null,null,null,null,null,"",null,null,null,null,null,null,null,null,null,null,null,null,null,null,null,null,null,"",null,null,null,null,null,null,null,null,null,null,null,null,null,null,null,null,null,null,null,null,null,null,null,null,null,null,null,null,0,0,"","","",0,null,null,"",0,"1901-12-31","1902-12-30",null,null,null,null,null,null,null,null,"2021-03-18",0,"","","","","","","","",0,0,{"$f":"VLOOKUP($CR100,SurveyDataContacts,'Survey Contacts'!$L$24,FALSE)","v":{"$error":"#N/A"}},{"$f":"VLOOKUP($CR100,SurveyDataContacts,'Survey Contacts'!$T$24,FALSE)","v":{"$error":"#N/A"}},{"$f":"VLOOKUP($CR100,SurveyDataContacts,'Survey Contacts'!$AL$24,FALSE)","v":{"$error":"#N/A"}},"",{"$f":"VLOOKUP($CR100,SurveyDataContacts,'Survey Contacts'!$BD$24,FALSE)","v":{"$error":"#N/A"}},{"$f":"VLOOKUP($CR100,SurveyDataContacts,'Survey Contacts'!$DS$24,FALSE)","v":{"$error":"#N/A"}},{"$f":"VLOOKUP($CR100,SurveyDataContacts,'Survey Contacts'!$BV$24,FALSE)","v":{"$error":"#N/A"}},{"$f":"VLOOKUP($CR100,SurveyDataContacts,'Survey Contacts'!$CQ$24,FALSE)","v":{"$error":"#N/A"}},{"$f":"VLOOKUP($CR100,SurveyDataContacts,'Survey Contacts'!$DE$24,FALSE)","v":{"$error":"#N/A"}},{"$error":"#N/A"},{"$error":"#N/A"},{"$error":"#N/A"},{"$error":"#N/A"},1900,"0 - 1900",null,"01900",{"$f":"VLOOKUP($D100,HQ_Contacts,'HQ and Regional Contacts'!$Q$24,FALSE)","v":{"$error":"#N/A"}},{"$f":"VLOOKUP($D100,HQ_Contacts,'HQ and Regional Contacts'!$Y$24,FALSE)","v":{"$error":"#N/A"}},{"$f":"VLOOKUP($D100,HQ_Contacts,'HQ and Regional Contacts'!$AQ$24,FALSE)","v":{"$error":"#N/A"}},"",{"$f":"VLOOKUP($D100,HQ_Contacts,'HQ and Regional Contacts'!$BI$24,FALSE)","v":{"$error":"#N/A"}},{"$f":"VLOOKUP($D100,HQ_Contacts,'HQ and Regional Contacts'!$DX$24,FALSE)","v":{"$error":"#N/A"}},{"$f":"VLOOKUP($D100,HQ_Contacts,'HQ and Regional Contacts'!$CA$24,FALSE)","v":{"$error":"#N/A"}},{"$f":"VLOOKUP($D100,HQ_Contacts,'HQ and Regional Contacts'!$CV$24,FALSE)","v":{"$error":"#N/A"}},{"$f":"VLOOKUP($D100,HQ_Contacts,'HQ and Regional Contacts'!$DJ$24,FALSE)","v":{"$error":"#N/A"}},null,null,"Same Individual","","","","","","","","","","",null,"","Yes",null,null,null,"","00-Jan-1900",{"$error":"#VALUE!"},{"$f":"IF('Order Form'!$L$101=\"NGO\",\"\",\" (CDO Pricing); \")","v":" (CDO Pricing); "},{"$f":"IF(#REF!=\"X\",\"Indigo Access;\",\"\")","v":{"$error":"#REF!"}},"","",{"$f":"IF(#REF!=\"\",\"\",\"Subsector: \"&#REF!&\";\")","v":{"$error":"#REF!"}},"No data to provide;",null,""]
[null,null,48,null,null,null,null,null,null,null,null,null,null,null,null,null,null,"",null,null,null,null,null,null,null,null,null,null,null,null,null,null,null,null,null,"",null,null,null,null,null,null,null,null,null,null,null,null,null,null,null,null,null,null,null,null,null,null,null,null,null,null,null,null,0,0,"","","",0,null,null,"",0,"1901-12-31","1902-12-30",null,null,null,null,null,null,null,null,"2021-03-18",0,"","","","","","","","",0,0,{"$f":"VLOOKUP($CR101,SurveyDataContacts,'Survey Contacts'!$L$24,FALSE)","v":{"$error":"#N/A"}},{"$f":"VLOOKUP($CR101,SurveyDataContacts,'Survey Contacts'!$T$24,FALSE)","v":{"$error":"#N/A"}},{"$f":"VLOOKUP($CR101,SurveyDataContacts,'Survey Contacts'!$AL$24,FALSE)","v":{"$error":"#N/A"}},"",{"$f":"VLOOKUP($CR101,SurveyDataContacts,'Survey Contacts'!$BD$24,FALSE)","v":{"$error":"#N/A"}},{"$f":"VLOOKUP($CR101,SurveyDataContacts,'Survey Contacts'!$DS$24,FALSE)","v":{"$error":"#N/A"}},{"$f":"VLOOKUP($CR101,SurveyDataContacts,'Survey Contacts'!$BV$24,FALSE)","v":{"$error":"#N/A"}},{"$f":"VLOOKUP($CR101,SurveyDataContacts,'Survey Contacts'!$CQ$24,FALSE)","v":{"$error":"#N/A"}},{"$f":"VLOOKUP($CR101,SurveyDataContacts,'Survey Contacts'!$DE$24,FALSE)","v":{"$error":"#N/A"}},{"$error":"#N/A"},{"$error":"#N/A"},{"$error":"#N/A"},{"$error":"#N/A"},1900,"0 - 1900",null,"01900",{"$f":"VLOOKUP($D101,HQ_Contacts,'HQ and Regional Contacts'!$Q$24,FALSE)","v":{"$error":"#N/A"}},{"$f":"VLOOKUP($D101,HQ_Contacts,'HQ and Regional Contacts'!$Y$24,FALSE)","v":{"$error":"#N/A"}},{"$f":"VLOOKUP($D101,HQ_Contacts,'HQ and Regional Contacts'!$AQ$24,FALSE)","v":{"$error":"#N/A"}},"",{"$f":"VLOOKUP($D101,HQ_Contacts,'HQ and Regional Contacts'!$BI$24,FALSE)","v":{"$error":"#N/A"}},{"$f":"VLOOKUP($D101,HQ_Contacts,'HQ and Regional Contacts'!$DX$24,FALSE)","v":{"$error":"#N/A"}},{"$f":"VLOOKUP($D101,HQ_Contacts,'HQ and Regional Contacts'!$CA$24,FALSE)","v":{"$error":"#N/A"}},{"$f":"VLOOKUP($D101,HQ_Contacts,'HQ and Regional Contacts'!$CV$24,FALSE)","v":{"$error":"#N/A"}},{"$f":"VLOOKUP($D101,HQ_Contacts,'HQ and Regional Contacts'!$DJ$24,FALSE)","v":{"$error":"#N/A"}},null,null,"Same Individual","","","","","","","","","","",null,"","Yes",null,null,null,"","00-Jan-1900",{"$error":"#VALUE!"},{"$f":"IF('Order Form'!$L$101=\"NGO\",\"\",\" (CDO Pricing); \")","v":" (CDO Pricing); "},{"$f":"IF(#REF!=\"X\",\"Indigo Access;\",\"\")","v":{"$error":"#REF!"}},"","",{"$f":"IF(#REF!=\"\",\"\",\"Subsector: \"&#REF!&\";\")","v":{"$error":"#REF!"}},"No data to provide;",null,""]
[null,null,49,null,null,null,null,null,null,null,null,null,null,null,null,null,null,"",null,null,null,null,null,null,null,null,null,null,null,null,null,null,null,null,null,"",null,null,null,null,null,null,null,null,null,null,null,null,null,null,null,null,null,null,null,null,null,null,null,null,null,null,null,null,0,0,"","","",0,null,null,"",0,"1901-12-31","1902-12-30",null,null,null,null,null,null,null,null,"2021-03-18",0,"","","","","","","","",0,0,{"$f":"VLOOKUP($CR102,SurveyDataContacts,'Survey Contacts'!$L$24,FALSE)","v":{"$error":"#N/A"}},{"$f":"VLOOKUP($CR102,SurveyDataContacts,'Survey Contacts'!$T$24,FALSE)","v":{"$error":"#N/A"}},{"$f":"VLOOKUP($CR102,SurveyDataContacts,'Survey Contacts'!$AL$24,FALSE)","v":{"$error":"#N/A"}},"",{"$f":"VLOOKUP($CR102,SurveyDataContacts,'Survey Contacts'!$BD$24,FALSE)","v":{"$error":"#N/A"}},{"$f":"VLOOKUP($CR102,SurveyDataContacts,'Survey Contacts'!$DS$24,FALSE)","v":{"$error":"#N/A"}},{"$f":"VLOOKUP($CR102,SurveyDataContacts,'Survey Contacts'!$BV$24,FALSE)","v":{"$error":"#N/A"}},{"$f":"VLOOKUP($CR102,SurveyDataContacts,'Survey Contacts'!$CQ$24,FALSE)","v":{"$error":"#N/A"}},{"$f":"VLOOKUP($CR102,SurveyDataContacts,'Survey Contacts'!$DE$24,FALSE)","v":{"$error":"#N/A"}},{"$error":"#N/A"},{"$error":"#N/A"},{"$error":"#N/A"},{"$error":"#N/A"},1900,"0 - 1900",null,"01900",{"$f":"VLOOKUP($D102,HQ_Contacts,'HQ and Regional Contacts'!$Q$24,FALSE)","v":{"$error":"#N/A"}},{"$f":"VLOOKUP($D102,HQ_Contacts,'HQ and Regional Contacts'!$Y$24,FALSE)","v":{"$error":"#N/A"}},{"$f":"VLOOKUP($D102,HQ_Contacts,'HQ and Regional Contacts'!$AQ$24,FALSE)","v":{"$error":"#N/A"}},"",{"$f":"VLOOKUP($D102,HQ_Contacts,'HQ and Regional Contacts'!$BI$24,FALSE)","v":{"$error":"#N/A"}},{"$f":"VLOOKUP($D102,HQ_Contacts,'HQ and Regional Contacts'!$DX$24,FALSE)","v":{"$error":"#N/A"}},{"$f":"VLOOKUP($D102,HQ_Contacts,'HQ and Regional Contacts'!$CA$24,FALSE)","v":{"$error":"#N/A"}},{"$f":"VLOOKUP($D102,HQ_Contacts,'HQ and Regional Contacts'!$CV$24,FALSE)","v":{"$error":"#N/A"}},{"$f":"VLOOKUP($D102,HQ_Contacts,'HQ and Regional Contacts'!$DJ$24,FALSE)","v":{"$error":"#N/A"}},null,null,"Same Individual","","","","","","","","","","",null,"","Yes",null,null,null,"","00-Jan-1900",{"$error":"#VALUE!"},{"$f":"IF('Order Form'!$L$101=\"NGO\",\"\",\" (CDO Pricing); \")","v":" (CDO Pricing); "},{"$f":"IF(#REF!=\"X\",\"Indigo Access;\",\"\")","v":{"$error":"#REF!"}},"","",{"$f":"IF(#REF!=\"\",\"\",\"Subsector: \"&#REF!&\";\")","v":{"$error":"#REF!"}},"No data to provide;",null,""]
[null,null,50,null,null,null,null,null,null,null,null,null,null,null,null,null,null,"",null,null,null,null,null,null,null,null,null,null,null,null,null,null,null,null,null,"",null,null,null,null,null,null,null,null,null,null,null,null,null,null,null,null,null,null,null,null,null,null,null,null,null,null,null,null,0,0,"","","",0,null,null,"",0,"1901-12-31","1902-12-30",null,null,null,null,null,null,null,null,"2021-03-18",0,"","","","","","","","",0,0,{"$f":"VLOOKUP($CR103,SurveyDataContacts,'Survey Contacts'!$L$24,FALSE)","v":{"$error":"#N/A"}},{"$f":"VLOOKUP($CR103,SurveyDataContacts,'Survey Contacts'!$T$24,FALSE)","v":{"$error":"#N/A"}},{"$f":"VLOOKUP($CR103,SurveyDataContacts,'Survey Contacts'!$AL$24,FALSE)","v":{"$error":"#N/A"}},"",{"$f":"VLOOKUP($CR103,SurveyDataContacts,'Survey Contacts'!$BD$24,FALSE)","v":{"$error":"#N/A"}},{"$f":"VLOOKUP($CR103,SurveyDataContacts,'Survey Contacts'!$DS$24,FALSE)","v":{"$error":"#N/A"}},{"$f":"VLOOKUP($CR103,SurveyDataContacts,'Survey Contacts'!$BV$24,FALSE)","v":{"$error":"#N/A"}},{"$f":"VLOOKUP($CR103,SurveyDataContacts,'Survey Contacts'!$CQ$24,FALSE)","v":{"$error":"#N/A"}},{"$f":"VLOOKUP($CR103,SurveyDataContacts,'Survey Contacts'!$DE$24,FALSE)","v":{"$error":"#N/A"}},{"$error":"#N/A"},{"$error":"#N/A"},{"$error":"#N/A"},{"$error":"#N/A"},1900,"0 - 1900",null,"01900",{"$f":"VLOOKUP($D103,HQ_Contacts,'HQ and Regional Contacts'!$Q$24,FALSE)","v":{"$error":"#N/A"}},{"$f":"VLOOKUP($D103,HQ_Contacts,'HQ and Regional Contacts'!$Y$24,FALSE)","v":{"$error":"#N/A"}},{"$f":"VLOOKUP($D103,HQ_Contacts,'HQ and Regional Contacts'!$AQ$24,FALSE)","v":{"$error":"#N/A"}},"",{"$f":"VLOOKUP($D103,HQ_Contacts,'HQ and Regional Contacts'!$BI$24,FALSE)","v":{"$error":"#N/A"}},{"$f":"VLOOKUP($D103,HQ_Contacts,'HQ and Regional Contacts'!$DX$24,FALSE)","v":{"$error":"#N/A"}},{"$f":"VLOOKUP($D103,HQ_Contacts,'HQ and Regional Contacts'!$CA$24,FALSE)","v":{"$error":"#N/A"}},{"$f":"VLOOKUP($D103,HQ_Contacts,'HQ and Regional Contacts'!$CV$24,FALSE)","v":{"$error":"#N/A"}},{"$f":"VLOOKUP($D103,HQ_Contacts,'HQ and Regional Contacts'!$DJ$24,FALSE)","v":{"$error":"#N/A"}},null,null,"Same Individual","","","","","","","","","","",null,"","Yes",null,null,null,"","00-Jan-1900",{"$error":"#VALUE!"},{"$f":"IF('Order Form'!$L$101=\"NGO\",\"\",\" (CDO Pricing); \")","v":" (CDO Pricing); "},{"$f":"IF(#REF!=\"X\",\"Indigo Access;\",\"\")","v":{"$error":"#REF!"}},"","",{"$f":"IF(#REF!=\"\",\"\",\"Subsector: \"&#REF!&\";\")","v":{"$error":"#REF!"}},"No data to provide;",null,""]
[null,null,51,null,null,null,null,null,null,null,null,null,null,null,null,null,null,"",null,null,null,null,null,null,null,null,null,null,null,null,null,null,null,null,null,"",null,null,null,null,null,null,null,null,null,null,null,null,null,null,null,null,null,null,null,null,null,null,null,null,null,null,null,null,0,0,"","","",0,null,null,"",0,"1901-12-31","1902-12-30",null,null,null,null,null,null,null,null,"2021-03-18",0,"","","","","","","","",0,0,{"$f":"VLOOKUP($CR104,SurveyDataContacts,'Survey Contacts'!$L$24,FALSE)","v":{"$error":"#N/A"}},{"$f":"VLOOKUP($CR104,SurveyDataContacts,'Survey Contacts'!$T$24,FALSE)","v":{"$error":"#N/A"}},{"$f":"VLOOKUP($CR104,SurveyDataContacts,'Survey Contacts'!$AL$24,FALSE)","v":{"$error":"#N/A"}},"",{"$f":"VLOOKUP($CR104,SurveyDataContacts,'Survey Contacts'!$BD$24,FALSE)","v":{"$error":"#N/A"}},{"$f":"VLOOKUP($CR104,SurveyDataContacts,'Survey Contacts'!$DS$24,FALSE)","v":{"$error":"#N/A"}},{"$f":"VLOOKUP($CR104,SurveyDataContacts,'Survey Contacts'!$BV$24,FALSE)","v":{"$error":"#N/A"}},{"$f":"VLOOKUP($CR104,SurveyDataContacts,'Survey Contacts'!$CQ$24,FALSE)","v":{"$error":"#N/A"}},{"$f":"VLOOKUP($CR104,SurveyDataContacts,'Survey Contacts'!$DE$24,FALSE)","v":{"$error":"#N/A"}},{"$error":"#N/A"},{"$error":"#N/A"},{"$error":"#N/A"},{"$error":"#N/A"},1900,"0 - 1900",null,"01900",{"$f":"VLOOKUP($D104,HQ_Contacts,'HQ and Regional Contacts'!$Q$24,FALSE)","v":{"$error":"#N/A"}},{"$f":"VLOOKUP($D104,HQ_Contacts,'HQ and Regional Contacts'!$Y$24,FALSE)","v":{"$error":"#N/A"}},{"$f":"VLOOKUP($D104,HQ_Contacts,'HQ and Regional Contacts'!$AQ$24,FALSE)","v":{"$error":"#N/A"}},"",{"$f":"VLOOKUP($D104,HQ_Contacts,'HQ and Regional Contacts'!$BI$24,FALSE)","v":{"$error":"#N/A"}},{"$f":"VLOOKUP($D104,HQ_Contacts,'HQ and Regional Contacts'!$DX$24,FALSE)","v":{"$error":"#N/A"}},{"$f":"VLOOKUP($D104,HQ_Contacts,'HQ and Regional Contacts'!$CA$24,FALSE)","v":{"$error":"#N/A"}},{"$f":"VLOOKUP($D104,HQ_Contacts,'HQ and Regional Contacts'!$CV$24,FALSE)","v":{"$error":"#N/A"}},{"$f":"VLOOKUP($D104,HQ_Contacts,'HQ and Regional Contacts'!$DJ$24,FALSE)","v":{"$error":"#N/A"}},null,null,"Same Individual","","","","","","","","","","",null,"","Yes",null,null,null,"","00-Jan-1900",{"$error":"#VALUE!"},{"$f":"IF('Order Form'!$L$101=\"NGO\",\"\",\" (CDO Pricing); \")","v":" (CDO Pricing); "},{"$f":"IF(#REF!=\"X\",\"Indigo Access;\",\"\")","v":{"$error":"#REF!"}},"","",{"$f":"IF(#REF!=\"\",\"\",\"Subsector: \"&#REF!&\";\")","v":{"$error":"#REF!"}},"No data to provide;",null,""]
[null,null,52,null,null,null,null,null,null,null,null,null,null,null,null,null,null,"",null,null,null,null,null,null,null,null,null,null,null,null,null,null,null,null,null,"",null,null,null,null,null,null,null,null,null,null,null,null,null,null,null,null,null,null,null,null,null,null,null,null,null,null,null,null,0,0,"","","",0,null,null,"",0,"1901-12-31","1902-12-30",null,null,null,null,null,null,null,null,"2021-03-18",0,"","","","","","","","",0,0,{"$f":"VLOOKUP($CR105,SurveyDataContacts,'Survey Contacts'!$L$24,FALSE)","v":{"$error":"#N/A"}},{"$f":"VLOOKUP($CR105,SurveyDataContacts,'Survey Contacts'!$T$24,FALSE)","v":{"$error":"#N/A"}},{"$f":"VLOOKUP($CR105,SurveyDataContacts,'Survey Contacts'!$AL$24,FALSE)","v":{"$error":"#N/A"}},"",{"$f":"VLOOKUP($CR105,SurveyDataContacts,'Survey Contacts'!$BD$24,FALSE)","v":{"$error":"#N/A"}},{"$f":"VLOOKUP($CR105,SurveyDataContacts,'Survey Contacts'!$DS$24,FALSE)","v":{"$error":"#N/A"}},{"$f":"VLOOKUP($CR105,SurveyDataContacts,'Survey Contacts'!$BV$24,FALSE)","v":{"$error":"#N/A"}},{"$f":"VLOOKUP($CR105,SurveyDataContacts,'Survey Contacts'!$CQ$24,FALSE)","v":{"$error":"#N/A"}},{"$f":"VLOOKUP($CR105,SurveyDataContacts,'Survey Contacts'!$DE$24,FALSE)","v":{"$error":"#N/A"}},{"$error":"#N/A"},{"$error":"#N/A"},{"$error":"#N/A"},{"$error":"#N/A"},1900,"0 - 1900",null,"01900",{"$f":"VLOOKUP($D105,HQ_Contacts,'HQ and Regional Contacts'!$Q$24,FALSE)","v":{"$error":"#N/A"}},{"$f":"VLOOKUP($D105,HQ_Contacts,'HQ and Regional Contacts'!$Y$24,FALSE)","v":{"$error":"#N/A"}},{"$f":"VLOOKUP($D105,HQ_Contacts,'HQ and Regional Contacts'!$AQ$24,FALSE)","v":{"$error":"#N/A"}},"",{"$f":"VLOOKUP($D105,HQ_Contacts,'HQ and Regional Contacts'!$BI$24,FALSE)","v":{"$error":"#N/A"}},{"$f":"VLOOKUP($D105,HQ_Contacts,'HQ and Regional Contacts'!$DX$24,FALSE)","v":{"$error":"#N/A"}},{"$f":"VLOOKUP($D105,HQ_Contacts,'HQ and Regional Contacts'!$CA$24,FALSE)","v":{"$error":"#N/A"}},{"$f":"VLOOKUP($D105,HQ_Contacts,'HQ and Regional Contacts'!$CV$24,FALSE)","v":{"$error":"#N/A"}},{"$f":"VLOOKUP($D105,HQ_Contacts,'HQ and Regional Contacts'!$DJ$24,FALSE)","v":{"$error":"#N/A"}},null,null,"Same Individual","","","","","","","","","","",null,"","Yes",null,null,null,"","00-Jan-1900",{"$error":"#VALUE!"},{"$f":"IF('Order Form'!$L$101=\"NGO\",\"\",\" (CDO Pricing); \")","v":" (CDO Pricing); "},{"$f":"IF(#REF!=\"X\",\"Indigo Access;\",\"\")","v":{"$error":"#REF!"}},"","",{"$f":"IF(#REF!=\"\",\"\",\"Subsector: \"&#REF!&\";\")","v":{"$error":"#REF!"}},"No data to provide;",null,""]
[null,null,53,null,null,null,null,null,null,null,null,null,null,null,null,null,null,"",null,null,null,null,null,null,null,null,null,null,null,null,null,null,null,null,null,"",null,null,null,null,null,null,null,null,null,null,null,null,null,null,null,null,null,null,null,null,null,null,null,null,null,null,null,null,0,0,"","","",0,null,null,"",0,"1901-12-31","1902-12-30",null,null,null,null,null,null,null,null,"2021-03-18",0,"","","","","","","","",0,0,{"$f":"VLOOKUP($CR106,SurveyDataContacts,'Survey Contacts'!$L$24,FALSE)","v":{"$error":"#N/A"}},{"$f":"VLOOKUP($CR106,SurveyDataContacts,'Survey Contacts'!$T$24,FALSE)","v":{"$error":"#N/A"}},{"$f":"VLOOKUP($CR106,SurveyDataContacts,'Survey Contacts'!$AL$24,FALSE)","v":{"$error":"#N/A"}},"",{"$f":"VLOOKUP($CR106,SurveyDataContacts,'Survey Contacts'!$BD$24,FALSE)","v":{"$error":"#N/A"}},{"$f":"VLOOKUP($CR106,SurveyDataContacts,'Survey Contacts'!$DS$24,FALSE)","v":{"$error":"#N/A"}},{"$f":"VLOOKUP($CR106,SurveyDataContacts,'Survey Contacts'!$BV$24,FALSE)","v":{"$error":"#N/A"}},{"$f":"VLOOKUP($CR106,SurveyDataContacts,'Survey Contacts'!$CQ$24,FALSE)","v":{"$error":"#N/A"}},{"$f":"VLOOKUP($CR106,SurveyDataContacts,'Survey Contacts'!$DE$24,FALSE)","v":{"$error":"#N/A"}},{"$error":"#N/A"},{"$error":"#N/A"},{"$error":"#N/A"},{"$error":"#N/A"},1900,"0 - 1900",null,"01900",{"$f":"VLOOKUP($D106,HQ_Contacts,'HQ and Regional Contacts'!$Q$24,FALSE)","v":{"$error":"#N/A"}},{"$f":"VLOOKUP($D106,HQ_Contacts,'HQ and Regional Contacts'!$Y$24,FALSE)","v":{"$error":"#N/A"}},{"$f":"VLOOKUP($D106,HQ_Contacts,'HQ and Regional Contacts'!$AQ$24,FALSE)","v":{"$error":"#N/A"}},"",{"$f":"VLOOKUP($D106,HQ_Contacts,'HQ and Regional Contacts'!$BI$24,FALSE)","v":{"$error":"#N/A"}},{"$f":"VLOOKUP($D106,HQ_Contacts,'HQ and Regional Contacts'!$DX$24,FALSE)","v":{"$error":"#N/A"}},{"$f":"VLOOKUP($D106,HQ_Contacts,'HQ and Regional Contacts'!$CA$24,FALSE)","v":{"$error":"#N/A"}},{"$f":"VLOOKUP($D106,HQ_Contacts,'HQ and Regional Contacts'!$CV$24,FALSE)","v":{"$error":"#N/A"}},{"$f":"VLOOKUP($D106,HQ_Contacts,'HQ and Regional Contacts'!$DJ$24,FALSE)","v":{"$error":"#N/A"}},null,null,"Same Individual","","","","","","","","","","",null,"","Yes",null,null,null,"","00-Jan-1900",{"$error":"#VALUE!"},{"$f":"IF('Order Form'!$L$101=\"NGO\",\"\",\" (CDO Pricing); \")","v":" (CDO Pricing); "},{"$f":"IF(#REF!=\"X\",\"Indigo Access;\",\"\")","v":{"$error":"#REF!"}},"","",{"$f":"IF(#REF!=\"\",\"\",\"Subsector: \"&#REF!&\";\")","v":{"$error":"#REF!"}},"No data to provide;",null,""]
[null,null,54,null,null,null,null,null,null,null,null,null,null,null,null,null,null,"",null,null,null,null,null,null,null,null,null,null,null,null,null,null,null,null,null,"",null,null,null,null,null,null,null,null,null,null,null,null,null,null,null,null,null,null,null,null,null,null,null,null,null,null,null,null,0,0,"","","",0,null,null,"",0,"1901-12-31","1902-12-30",null,null,null,null,null,null,null,null,"2021-03-18",0,"","","","","","","","",0,0,{"$f":"VLOOKUP($CR107,SurveyDataContacts,'Survey Contacts'!$L$24,FALSE)","v":{"$error":"#N/A"}},{"$f":"VLOOKUP($CR107,SurveyDataContacts,'Survey Contacts'!$T$24,FALSE)","v":{"$error":"#N/A"}},{"$f":"VLOOKUP($CR107,SurveyDataContacts,'Survey Contacts'!$AL$24,FALSE)","v":{"$error":"#N/A"}},"",{"$f":"VLOOKUP($CR107,SurveyDataContacts,'Survey Contacts'!$BD$24,FALSE)","v":{"$error":"#N/A"}},{"$f":"VLOOKUP($CR107,SurveyDataContacts,'Survey Contacts'!$DS$24,FALSE)","v":{"$error":"#N/A"}},{"$f":"VLOOKUP($CR107,SurveyDataContacts,'Survey Contacts'!$BV$24,FALSE)","v":{"$error":"#N/A"}},{"$f":"VLOOKUP($CR107,SurveyDataContacts,'Survey Contacts'!$CQ$24,FALSE)","v":{"$error":"#N/A"}},{"$f":"VLOOKUP($CR107,SurveyDataContacts,'Survey Contacts'!$DE$24,FALSE)","v":{"$error":"#N/A"}},{"$error":"#N/A"},{"$error":"#N/A"},{"$error":"#N/A"},{"$error":"#N/A"},1900,"0 - 1900",null,"01900",{"$f":"VLOOKUP($D107,HQ_Contacts,'HQ and Regional Contacts'!$Q$24,FALSE)","v":{"$error":"#N/A"}},{"$f":"VLOOKUP($D107,HQ_Contacts,'HQ and Regional Contacts'!$Y$24,FALSE)","v":{"$error":"#N/A"}},{"$f":"VLOOKUP($D107,HQ_Contacts,'HQ and Regional Contacts'!$AQ$24,FALSE)","v":{"$error":"#N/A"}},"",{"$f":"VLOOKUP($D107,HQ_Contacts,'HQ and Regional Contacts'!$BI$24,FALSE)","v":{"$error":"#N/A"}},{"$f":"VLOOKUP($D107,HQ_Contacts,'HQ and Regional Contacts'!$DX$24,FALSE)","v":{"$error":"#N/A"}},{"$f":"VLOOKUP($D107,HQ_Contacts,'HQ and Regional Contacts'!$CA$24,FALSE)","v":{"$error":"#N/A"}},{"$f":"VLOOKUP($D107,HQ_Contacts,'HQ and Regional Contacts'!$CV$24,FALSE)","v":{"$error":"#N/A"}},{"$f":"VLOOKUP($D107,HQ_Contacts,'HQ and Regional Contacts'!$DJ$24,FALSE)","v":{"$error":"#N/A"}},null,null,"Same Individual","","","","","","","","","","",null,"","Yes",null,null,null,"","00-Jan-1900",{"$error":"#VALUE!"},{"$f":"IF('Order Form'!$L$101=\"NGO\",\"\",\" (CDO Pricing); \")","v":" (CDO Pricing); "},{"$f":"IF(#REF!=\"X\",\"Indigo Access;\",\"\")","v":{"$error":"#REF!"}},"","",{"$f":"IF(#REF!=\"\",\"\",\"Subsector: \"&#REF!&\";\")","v":{"$error":"#REF!"}},"No data to provide;",null,""]
[null,null,55,null,null,null,null,null,null,null,null,null,null,null,null,null,null,"",null,null,null,null,null,null,null,null,null,null,null,null,null,null,null,null,null,"",null,null,null,null,null,null,null,null,null,null,null,null,null,null,null,null,null,null,null,null,null,null,null,null,null,null,null,null,0,0,"","","",0,null,null,"",0,"1901-12-31","1902-12-30",null,null,null,null,null,null,null,null,"2021-03-18",0,"","","","","","","","",0,0,{"$f":"VLOOKUP($CR108,SurveyDataContacts,'Survey Contacts'!$L$24,FALSE)","v":{"$error":"#N/A"}},{"$f":"VLOOKUP($CR108,SurveyDataContacts,'Survey Contacts'!$T$24,FALSE)","v":{"$error":"#N/A"}},{"$f":"VLOOKUP($CR108,SurveyDataContacts,'Survey Contacts'!$AL$24,FALSE)","v":{"$error":"#N/A"}},"",{"$f":"VLOOKUP($CR108,SurveyDataContacts,'Survey Contacts'!$BD$24,FALSE)","v":{"$error":"#N/A"}},{"$f":"VLOOKUP($CR108,SurveyDataContacts,'Survey Contacts'!$DS$24,FALSE)","v":{"$error":"#N/A"}},{"$f":"VLOOKUP($CR108,SurveyDataContacts,'Survey Contacts'!$BV$24,FALSE)","v":{"$error":"#N/A"}},{"$f":"VLOOKUP($CR108,SurveyDataContacts,'Survey Contacts'!$CQ$24,FALSE)","v":{"$error":"#N/A"}},{"$f":"VLOOKUP($CR108,SurveyDataContacts,'Survey Contacts'!$DE$24,FALSE)","v":{"$error":"#N/A"}},{"$error":"#N/A"},{"$error":"#N/A"},{"$error":"#N/A"},{"$error":"#N/A"},1900,"0 - 1900",null,"01900",{"$f":"VLOOKUP($D108,HQ_Contacts,'HQ and Regional Contacts'!$Q$24,FALSE)","v":{"$error":"#N/A"}},{"$f":"VLOOKUP($D108,HQ_Contacts,'HQ and Regional Contacts'!$Y$24,FALSE)","v":{"$error":"#N/A"}},{"$f":"VLOOKUP($D108,HQ_Contacts,'HQ and Regional Contacts'!$AQ$24,FALSE)","v":{"$error":"#N/A"}},"",{"$f":"VLOOKUP($D108,HQ_Contacts,'HQ and Regional Contacts'!$BI$24,FALSE)","v":{"$error":"#N/A"}},{"$f":"VLOOKUP($D108,HQ_Contacts,'HQ and Regional Contacts'!$DX$24,FALSE)","v":{"$error":"#N/A"}},{"$f":"VLOOKUP($D108,HQ_Contacts,'HQ and Regional Contacts'!$CA$24,FALSE)","v":{"$error":"#N/A"}},{"$f":"VLOOKUP($D108,HQ_Contacts,'HQ and Regional Contacts'!$CV$24,FALSE)","v":{"$error":"#N/A"}},{"$f":"VLOOKUP($D108,HQ_Contacts,'HQ and Regional Contacts'!$DJ$24,FALSE)","v":{"$error":"#N/A"}},null,null,"Same Individual","","","","","","","","","","",null,"","Yes",null,null,null,"","00-Jan-1900",{"$error":"#VALUE!"},{"$f":"IF('Order Form'!$L$101=\"NGO\",\"\",\" (CDO Pricing); \")","v":" (CDO Pricing); "},{"$f":"IF(#REF!=\"X\",\"Indigo Access;\",\"\")","v":{"$error":"#REF!"}},"","",{"$f":"IF(#REF!=\"\",\"\",\"Subsector: \"&#REF!&\";\")","v":{"$error":"#REF!"}},"No data to provide;",null,""]
[null,null,56,null,null,null,null,null,null,null,null,null,null,null,null,null,null,"",null,null,null,null,null,null,null,null,null,null,null,null,null,null,null,null,null,"",null,null,null,null,null,null,null,null,null,null,null,null,null,null,null,null,null,null,null,null,null,null,null,null,null,null,null,null,0,0,"","","",0,null,null,"",0,"1901-12-31","1902-12-30",null,null,null,null,null,null,null,null,"2021-03-18",0,"","","","","","","","",0,0,{"$f":"VLOOKUP($CR109,SurveyDataContacts,'Survey Contacts'!$L$24,FALSE)","v":{"$error":"#N/A"}},{"$f":"VLOOKUP($CR109,SurveyDataContacts,'Survey Contacts'!$T$24,FALSE)","v":{"$error":"#N/A"}},{"$f":"VLOOKUP($CR109,SurveyDataContacts,'Survey Contacts'!$AL$24,FALSE)","v":{"$error":"#N/A"}},"",{"$f":"VLOOKUP($CR109,SurveyDataContacts,'Survey Contacts'!$BD$24,FALSE)","v":{"$error":"#N/A"}},{"$f":"VLOOKUP($CR109,SurveyDataContacts,'Survey Contacts'!$DS$24,FALSE)","v":{"$error":"#N/A"}},{"$f":"VLOOKUP($CR109,SurveyDataContacts,'Survey Contacts'!$BV$24,FALSE)","v":{"$error":"#N/A"}},{"$f":"VLOOKUP($CR109,SurveyDataContacts,'Survey Contacts'!$CQ$24,FALSE)","v":{"$error":"#N/A"}},{"$f":"VLOOKUP($CR109,SurveyDataContacts,'Survey Contacts'!$DE$24,FALSE)","v":{"$error":"#N/A"}},{"$error":"#N/A"},{"$error":"#N/A"},{"$error":"#N/A"},{"$error":"#N/A"},1900,"0 - 1900",null,"01900",{"$f":"VLOOKUP($D109,HQ_Contacts,'HQ and Regional Contacts'!$Q$24,FALSE)","v":{"$error":"#N/A"}},{"$f":"VLOOKUP($D109,HQ_Contacts,'HQ and Regional Contacts'!$Y$24,FALSE)","v":{"$error":"#N/A"}},{"$f":"VLOOKUP($D109,HQ_Contacts,'HQ and Regional Contacts'!$AQ$24,FALSE)","v":{"$error":"#N/A"}},"",{"$f":"VLOOKUP($D109,HQ_Contacts,'HQ and Regional Contacts'!$BI$24,FALSE)","v":{"$error":"#N/A"}},{"$f":"VLOOKUP($D109,HQ_Contacts,'HQ and Regional Contacts'!$DX$24,FALSE)","v":{"$error":"#N/A"}},{"$f":"VLOOKUP($D109,HQ_Contacts,'HQ and Regional Contacts'!$CA$24,FALSE)","v":{"$error":"#N/A"}},{"$f":"VLOOKUP($D109,HQ_Contacts,'HQ and Regional Contacts'!$CV$24,FALSE)","v":{"$error":"#N/A"}},{"$f":"VLOOKUP($D109,HQ_Contacts,'HQ and Regional Contacts'!$DJ$24,FALSE)","v":{"$error":"#N/A"}},null,null,"Same Individual","","","","","","","","","","",null,"","Yes",null,null,null,"","00-Jan-1900",{"$error":"#VALUE!"},{"$f":"IF('Order Form'!$L$101=\"NGO\",\"\",\" (CDO Pricing); \")","v":" (CDO Pricing); "},{"$f":"IF(#REF!=\"X\",\"Indigo Access;\",\"\")","v":{"$error":"#REF!"}},"","",{"$f":"IF(#REF!=\"\",\"\",\"Subsector: \"&#REF!&\";\")","v":{"$error":"#REF!"}},"No data to provide;",null,""]
[null,null,57,null,null,null,null,null,null,null,null,null,null,null,null,null,null,"",null,null,null,null,null,null,null,null,null,null,null,null,null,null,null,null,null,"",null,null,null,null,null,null,null,null,null,null,null,null,null,null,null,null,null,null,null,null,null,null,null,null,null,null,null,null,0,0,"","","",0,null,null,"",0,"1901-12-31","1902-12-30",null,null,null,null,null,null,null,null,"2021-03-18",0,"","","","","","","","",0,0,{"$f":"VLOOKUP($CR110,SurveyDataContacts,'Survey Contacts'!$L$24,FALSE)","v":{"$error":"#N/A"}},{"$f":"VLOOKUP($CR110,SurveyDataContacts,'Survey Contacts'!$T$24,FALSE)","v":{"$error":"#N/A"}},{"$f":"VLOOKUP($CR110,SurveyDataContacts,'Survey Contacts'!$AL$24,FALSE)","v":{"$error":"#N/A"}},"",{"$f":"VLOOKUP($CR110,SurveyDataContacts,'Survey Contacts'!$BD$24,FALSE)","v":{"$error":"#N/A"}},{"$f":"VLOOKUP($CR110,SurveyDataContacts,'Survey Contacts'!$DS$24,FALSE)","v":{"$error":"#N/A"}},{"$f":"VLOOKUP($CR110,SurveyDataContacts,'Survey Contacts'!$BV$24,FALSE)","v":{"$error":"#N/A"}},{"$f":"VLOOKUP($CR110,SurveyDataContacts,'Survey Contacts'!$CQ$24,FALSE)","v":{"$error":"#N/A"}},{"$f":"VLOOKUP($CR110,SurveyDataContacts,'Survey Contacts'!$DE$24,FALSE)","v":{"$error":"#N/A"}},{"$error":"#N/A"},{"$error":"#N/A"},{"$error":"#N/A"},{"$error":"#N/A"},1900,"0 - 1900",null,"01900",{"$f":"VLOOKUP($D110,HQ_Contacts,'HQ and Regional Contacts'!$Q$24,FALSE)","v":{"$error":"#N/A"}},{"$f":"VLOOKUP($D110,HQ_Contacts,'HQ and Regional Contacts'!$Y$24,FALSE)","v":{"$error":"#N/A"}},{"$f":"VLOOKUP($D110,HQ_Contacts,'HQ and Regional Contacts'!$AQ$24,FALSE)","v":{"$error":"#N/A"}},"",{"$f":"VLOOKUP($D110,HQ_Contacts,'HQ and Regional Contacts'!$BI$24,FALSE)","v":{"$error":"#N/A"}},{"$f":"VLOOKUP($D110,HQ_Contacts,'HQ and Regional Contacts'!$DX$24,FALSE)","v":{"$error":"#N/A"}},{"$f":"VLOOKUP($D110,HQ_Contacts,'HQ and Regional Contacts'!$CA$24,FALSE)","v":{"$error":"#N/A"}},{"$f":"VLOOKUP($D110,HQ_Contacts,'HQ and Regional Contacts'!$CV$24,FALSE)","v":{"$error":"#N/A"}},{"$f":"VLOOKUP($D110,HQ_Contacts,'HQ and Regional Contacts'!$DJ$24,FALSE)","v":{"$error":"#N/A"}},null,null,"Same Individual","","","","","","","","","","",null,"","Yes",null,null,null,"","00-Jan-1900",{"$error":"#VALUE!"},{"$f":"IF('Order Form'!$L$101=\"NGO\",\"\",\" (CDO Pricing); \")","v":" (CDO Pricing); "},{"$f":"IF(#REF!=\"X\",\"Indigo Access;\",\"\")","v":{"$error":"#REF!"}},"","",{"$f":"IF(#REF!=\"\",\"\",\"Subsector: \"&#REF!&\";\")","v":{"$error":"#REF!"}},"No data to provide;",null,""]
[null,null,58,null,null,null,null,null,null,null,null,null,null,null,null,null,null,"",null,null,null,null,null,null,null,null,null,null,null,null,null,null,null,null,null,"",null,null,null,null,null,null,null,null,null,null,null,null,null,null,null,null,null,null,null,null,null,null,null,null,null,null,null,null,0,0,"","","",0,null,null,"",0,"1901-12-31","1902-12-30",null,null,null,null,null,null,null,null,"2021-03-18",0,"","","","","","","","",0,0,{"$f":"VLOOKUP($CR111,SurveyDataContacts,'Survey Contacts'!$L$24,FALSE)","v":{"$error":"#N/A"}},{"$f":"VLOOKUP($CR111,SurveyDataContacts,'Survey Contacts'!$T$24,FALSE)","v":{"$error":"#N/A"}},{"$f":"VLOOKUP($CR111,SurveyDataContacts,'Survey Contacts'!$AL$24,FALSE)","v":{"$error":"#N/A"}},"",{"$f":"VLOOKUP($CR111,SurveyDataContacts,'Survey Contacts'!$BD$24,FALSE)","v":{"$error":"#N/A"}},{"$f":"VLOOKUP($CR111,SurveyDataContacts,'Survey Contacts'!$DS$24,FALSE)","v":{"$error":"#N/A"}},{"$f":"VLOOKUP($CR111,SurveyDataContacts,'Survey Contacts'!$BV$24,FALSE)","v":{"$error":"#N/A"}},{"$f":"VLOOKUP($CR111,SurveyDataContacts,'Survey Contacts'!$CQ$24,FALSE)","v":{"$error":"#N/A"}},{"$f":"VLOOKUP($CR111,SurveyDataContacts,'Survey Contacts'!$DE$24,FALSE)","v":{"$error":"#N/A"}},{"$error":"#N/A"},{"$error":"#N/A"},{"$error":"#N/A"},{"$error":"#N/A"},1900,"0 - 1900",null,"01900",{"$f":"VLOOKUP($D111,HQ_Contacts,'HQ and Regional Contacts'!$Q$24,FALSE)","v":{"$error":"#N/A"}},{"$f":"VLOOKUP($D111,HQ_Contacts,'HQ and Regional Contacts'!$Y$24,FALSE)","v":{"$error":"#N/A"}},{"$f":"VLOOKUP($D111,HQ_Contacts,'HQ and Regional Contacts'!$AQ$24,FALSE)","v":{"$error":"#N/A"}},"",{"$f":"VLOOKUP($D111,HQ_Contacts,'HQ and Regional Contacts'!$BI$24,FALSE)","v":{"$error":"#N/A"}},{"$f":"VLOOKUP($D111,HQ_Contacts,'HQ and Regional Contacts'!$DX$24,FALSE)","v":{"$error":"#N/A"}},{"$f":"VLOOKUP($D111,HQ_Contacts,'HQ and Regional Contacts'!$CA$24,FALSE)","v":{"$error":"#N/A"}},{"$f":"VLOOKUP($D111,HQ_Contacts,'HQ and Regional Contacts'!$CV$24,FALSE)","v":{"$error":"#N/A"}},{"$f":"VLOOKUP($D111,HQ_Contacts,'HQ and Regional Contacts'!$DJ$24,FALSE)","v":{"$error":"#N/A"}},null,null,"Same Individual","","","","","","","","","","",null,"","Yes",null,null,null,"","00-Jan-1900",{"$error":"#VALUE!"},{"$f":"IF('Order Form'!$L$101=\"NGO\",\"\",\" (CDO Pricing); \")","v":" (CDO Pricing); "},{"$f":"IF(#REF!=\"X\",\"Indigo Access;\",\"\")","v":{"$error":"#REF!"}},"","",{"$f":"IF(#REF!=\"\",\"\",\"Subsector: \"&#REF!&\";\")","v":{"$error":"#REF!"}},"No data to provide;",null,""]
[null,null,59,null,null,null,null,null,null,null,null,null,null,null,null,null,null,"",null,null,null,null,null,null,null,null,null,null,null,null,null,null,null,null,null,"",null,null,null,null,null,null,null,null,null,null,null,null,null,null,null,null,null,null,null,null,null,null,null,null,null,null,null,null,0,0,"","","",0,null,null,"",0,"1901-12-31","1902-12-30",null,null,null,null,null,null,null,null,"2021-03-18",0,"","","","","","","","",0,0,{"$f":"VLOOKUP($CR112,SurveyDataContacts,'Survey Contacts'!$L$24,FALSE)","v":{"$error":"#N/A"}},{"$f":"VLOOKUP($CR112,SurveyDataContacts,'Survey Contacts'!$T$24,FALSE)","v":{"$error":"#N/A"}},{"$f":"VLOOKUP($CR112,SurveyDataContacts,'Survey Contacts'!$AL$24,FALSE)","v":{"$error":"#N/A"}},"",{"$f":"VLOOKUP($CR112,SurveyDataContacts,'Survey Contacts'!$BD$24,FALSE)","v":{"$error":"#N/A"}},{"$f":"VLOOKUP($CR112,SurveyDataContacts,'Survey Contacts'!$DS$24,FALSE)","v":{"$error":"#N/A"}},{"$f":"VLOOKUP($CR112,SurveyDataContacts,'Survey Contacts'!$BV$24,FALSE)","v":{"$error":"#N/A"}},{"$f":"VLOOKUP($CR112,SurveyDataContacts,'Survey Contacts'!$CQ$24,FALSE)","v":{"$error":"#N/A"}},{"$f":"VLOOKUP($CR112,SurveyDataContacts,'Survey Contacts'!$DE$24,FALSE)","v":{"$error":"#N/A"}},{"$error":"#N/A"},{"$error":"#N/A"},{"$error":"#N/A"},{"$error":"#N/A"},1900,"0 - 1900",null,"01900",{"$f":"VLOOKUP($D112,HQ_Contacts,'HQ and Regional Contacts'!$Q$24,FALSE)","v":{"$error":"#N/A"}},{"$f":"VLOOKUP($D112,HQ_Contacts,'HQ and Regional Contacts'!$Y$24,FALSE)","v":{"$error":"#N/A"}},{"$f":"VLOOKUP($D112,HQ_Contacts,'HQ and Regional Contacts'!$AQ$24,FALSE)","v":{"$error":"#N/A"}},"",{"$f":"VLOOKUP($D112,HQ_Contacts,'HQ and Regional Contacts'!$BI$24,FALSE)","v":{"$error":"#N/A"}},{"$f":"VLOOKUP($D112,HQ_Contacts,'HQ and Regional Contacts'!$DX$24,FALSE)","v":{"$error":"#N/A"}},{"$f":"VLOOKUP($D112,HQ_Contacts,'HQ and Regional Contacts'!$CA$24,FALSE)","v":{"$error":"#N/A"}},{"$f":"VLOOKUP($D112,HQ_Contacts,'HQ and Regional Contacts'!$CV$24,FALSE)","v":{"$error":"#N/A"}},{"$f":"VLOOKUP($D112,HQ_Contacts,'HQ and Regional Contacts'!$DJ$24,FALSE)","v":{"$error":"#N/A"}},null,null,"Same Individual","","","","","","","","","","",null,"","Yes",null,null,null,"","00-Jan-1900",{"$error":"#VALUE!"},{"$f":"IF('Order Form'!$L$101=\"NGO\",\"\",\" (CDO Pricing); \")","v":" (CDO Pricing); "},{"$f":"IF(#REF!=\"X\",\"Indigo Access;\",\"\")","v":{"$error":"#REF!"}},"","",{"$f":"IF(#REF!=\"\",\"\",\"Subsector: \"&#REF!&\";\")","v":{"$error":"#REF!"}},"No data to provide;",null,""]
[null,null,60,null,null,null,null,null,null,null,null,null,null,null,null,null,null,"",null,null,null,null,null,null,null,null,null,null,null,null,null,null,null,null,null,"",null,null,null,null,null,null,null,null,null,null,null,null,null,null,null,null,null,null,null,null,null,null,null,null,null,null,null,null,0,0,"","","",0,null,null,"",0,"1901-12-31","1902-12-30",null,null,null,null,null,null,null,null,"2021-03-18",0,"","","","","","","","",0,0,{"$f":"VLOOKUP($CR113,SurveyDataContacts,'Survey Contacts'!$L$24,FALSE)","v":{"$error":"#N/A"}},{"$f":"VLOOKUP($CR113,SurveyDataContacts,'Survey Contacts'!$T$24,FALSE)","v":{"$error":"#N/A"}},{"$f":"VLOOKUP($CR113,SurveyDataContacts,'Survey Contacts'!$AL$24,FALSE)","v":{"$error":"#N/A"}},"",{"$f":"VLOOKUP($CR113,SurveyDataContacts,'Survey Contacts'!$BD$24,FALSE)","v":{"$error":"#N/A"}},{"$f":"VLOOKUP($CR113,SurveyDataContacts,'Survey Contacts'!$DS$24,FALSE)","v":{"$error":"#N/A"}},{"$f":"VLOOKUP($CR113,SurveyDataContacts,'Survey Contacts'!$BV$24,FALSE)","v":{"$error":"#N/A"}},{"$f":"VLOOKUP($CR113,SurveyDataContacts,'Survey Contacts'!$CQ$24,FALSE)","v":{"$error":"#N/A"}},{"$f":"VLOOKUP($CR113,SurveyDataContacts,'Survey Contacts'!$DE$24,FALSE)","v":{"$error":"#N/A"}},{"$error":"#N/A"},{"$error":"#N/A"},{"$error":"#N/A"},{"$error":"#N/A"},1900,"0 - 1900",null,"01900",{"$f":"VLOOKUP($D113,HQ_Contacts,'HQ and Regional Contacts'!$Q$24,FALSE)","v":{"$error":"#N/A"}},{"$f":"VLOOKUP($D113,HQ_Contacts,'HQ and Regional Contacts'!$Y$24,FALSE)","v":{"$error":"#N/A"}},{"$f":"VLOOKUP($D113,HQ_Contacts,'HQ and Regional Contacts'!$AQ$24,FALSE)","v":{"$error":"#N/A"}},"",{"$f":"VLOOKUP($D113,HQ_Contacts,'HQ and Regional Contacts'!$BI$24,FALSE)","v":{"$error":"#N/A"}},{"$f":"VLOOKUP($D113,HQ_Contacts,'HQ and Regional Contacts'!$DX$24,FALSE)","v":{"$error":"#N/A"}},{"$f":"VLOOKUP($D113,HQ_Contacts,'HQ and Regional Contacts'!$CA$24,FALSE)","v":{"$error":"#N/A"}},{"$f":"VLOOKUP($D113,HQ_Contacts,'HQ and Regional Contacts'!$CV$24,FALSE)","v":{"$error":"#N/A"}},{"$f":"VLOOKUP($D113,HQ_Contacts,'HQ and Regional Contacts'!$DJ$24,FALSE)","v":{"$error":"#N/A"}},null,null,"Same Individual","","","","","","","","","","",null,"","Yes",null,null,null,"","00-Jan-1900",{"$error":"#VALUE!"},{"$f":"IF('Order Form'!$L$101=\"NGO\",\"\",\" (CDO Pricing); \")","v":" (CDO Pricing); "},{"$f":"IF(#REF!=\"X\",\"Indigo Access;\",\"\")","v":{"$error":"#REF!"}},"","",{"$f":"IF(#REF!=\"\",\"\",\"Subsector: \"&#REF!&\";\")","v":{"$error":"#REF!"}},"No data to provide;",null,""]
[null,null,"GP","NGO Global Pay",null,null,null,null,null,null,null,null,{"$f":"IF(NGOGPChoice=\"No\",\"\",IF(NGOGPChoice=\"Yes (Participant)\", \"Yes\",\"No\"))","v":""},null,null,null,null,{"$f":"IF(NGOGPChoice=\"Yes (Participant)\", \"NGO Global Pay\",IF(NGOGPChoice=\"Yes (Non-Participant)\",\"NGO Global Pay\",\"\"))","v":""},null,null,null,null,null,null,null,null,null,null,null,null,null,null,null,null,null,{"$f":"IF(ISBLANK(M114),0,IF(M114=\"Yes\",0,NGOGlobalPayFee*0.5))","v":0}]
[]
[null,null,null,null,null,null,null,null,null,null,null,null,"Total",null,null,null,null,"Surveys",null,null,null,null,null,null,null,null,null,null,null,null,null,null,null,null,null,"Non-Particiption Fee",null,null,null,null,null,null,"NGO Global Pay",null,null,null,null,null,null,null,null,null,null,null,null,null,null,null,null,null,null,null,null,null,{"$f":"OrgName","v":0},{"$f":"OrderNumber","v":0},{"$f":"TotalIndigo","v":0},{"$f":"SUM(BU54:BU113)","v":0},null,{"$f":"SUM(BP54:BP113)","v":0},null,{"$f":"SUM(BR54:BR113)","v":0},null,null,{"$f":"SUM(BT54:BT113)","v":0},{"$f":"SUM(BV54:BV113)","v":0}]
[null,null,null,null,null,null,"1st Year",null,null,null,null,{"$f":"ROUND(SUM(R117:AT117),0)","v":{"$error":"#N/A"}},null,null,null,null,null,{"$f":"NGOSP*COUNTA(D54:D113)","v":{"$error":"#N/A"}},null,null,null,null,null,null,null,null,null,null,null,null,null,null,null,null,null,{"$f":"SUM(AJ54:AN113)+AJ114","v":0},null,null,null,null,null,null,{"$f":"NGOGlobalPayFee","v":0}]
[null,null,null,"2nd Year",null,null,null,null,null,null,null,{"$f":"L117","v":{"$error":"#N/A"}},null,null,null,null,null,{"$f":"R117","v":{"$error":"#N/A"}},null,null,null,null,null,null,null,null,null,null,null,null,null,null,null,null,null,{"$f":"AJ117","v":0},null,null,null,null,null,null,{"$f":"NGOGlobalPayFee+AJ$114","v":0}]
[null,null,null,"3rd Year",null,null,null,null,null,null,null,{"$f":"L118","v":{"$error":"#N/A"}},null,null,null,null,null,{"$f":"R118","v":{"$error":"#N/A"}},null,null,null,null,null,null,null,null,null,null,null,null,null,null,null,null,null,{"$f":"AJ118","v":0},null,null,null,null,null,null,{"$f":"NGOGlobalPayFee+AJ$114","v":0}]
[null,null,null,"Total Fees :",null,null,null,null,null,null,null,{"$f":"SUM(L117:P119)","v":{"$error":"#N/A"}}]
[]
[]
[null,null,null,null,"Note:  All fees are net of tax.  If any  income tax, withholding tax, VAT or similar taxes are payable, the invoice amount will be"]
[null,null,null,null,"increased (grossed-up) and taxes will be withheld from the resulting balance."]
[]
[null,null,null,null,{"$f":"\"Tax rate applicable in \"&IF(AF36=\"\",AF24,AF36)&\":\"","v":"Tax rate applicable in :"},null,null,null,null,null,null,null,null,null,null,null,null,null,null,null,{"$f":"_xlfn.IFNA(VLOOKUP(IF(AF36=\"\",AF24,AF36),GrossUps,2,FALSE)*IF(AB126=\"\",1,0),\"Not Applicable\")","v":"Not Applicable"},null,null,null,null,null,null,null,null,null,"Type X to cancel application of tax"]
[null,null,null,null,"Tax Gross-up Amount:",null,null,null,null,null,null,null,null,null,null,null,null,null,null,null,{"$f":"IF(U126=\"Not Applicable\",0,ROUND((L117/(1-U126))-L117,2))","v":0}]
[]
[]
[]
[null,null,"Subscription Agreement"]
[null,null,"All data is sold via subscription for a 12-month period, beginning on the Subscription Start Date you entered on the first Order Form Page"]
[null,null,"Three survey updates are issued annually, in April, July and October.  Participants must contribute their organization's data once "]
[null,null,"  per year, within 60 days following annual pay review, or be subject to a non-participant surcharge (see Subscription Agreement, paragraph 18)."]
[]
[null,null,"All subscriptions require confirmation of Terms and Conditions via our Subscription Agreement.  "]
[]
[null,null,"Click HERE to review the Terms and Conditions and confirm your agreement."]
[]
[null,null,{"$f":"IF('Subscription Agreement'!$C$81=TRUE,\"Agreement Confirmed\",\"Agreement NOT Confirmed\")","v":"Agreement NOT Confirmed"},null,null,null,null,null,null,null,null,null,null,null,null,null,false]
[]
[null,null,"Notes / Special Billing Requests"]
[]
[]
[]
[]
[]
[]
[]
[]
[]
[null,null,null,"Country Information"]
[null,null,null,"Please indicate below, for each country in which you registered, the requested information.\nClick on the column header for further help."]
[null,null,null,"When finished, click on Go to Survey Access to continue."]
[null,null,null,null,{"$f":"COLUMN(E155)-4","v":1},null,null,null,null,null,null,null,null,{"$f":"COLUMN(N155)-4","v":10},null,null,null,null,null,null,null,null,{"$f":"COLUMN(W155)-4","v":19},null,null,null,null,null,null,null,null,{"$f":"COLUMN(AF155)-4","v":28}]
[null,null,null,null,null,null,null,null,null,null,null,null,null,null,null,null,null,null,null,null,null,null,null,null,null,null,null,null,null,null,null,"Pay Review Frequency",null,null,null,null,null,null,null,null,"Data Submission Month",null,null,null,null,null,null,null,null,"Data Submission Cycle"]
[null,null,null,null,"Survey Country",null,null,null,null,null,null,null,null,"Total Staff Count",null,null,null,null,null,null,null,null,"Next Pay Review Date"]
[null,null,null,null,null,null,null,null,null,null,null,null,null,null,null,null,null,null,null,null,null,null,null,null,null,null,null,null,null,null,null,null,null,null,null,null,null,null,null,null,null,null,null,null,null,null,null,null,null,{"$f":"IFERROR(VLOOKUP(AO158,DataCycles,2,FALSE),\"\")","v":""}]
[null,null,null,null,null,null,null,null,null,null,null,null,null,null,null,null,null,null,null,null,null,null,null,null,null,null,null,null,null,null,null,null,null,null,null,null,null,null,null,null,null,null,null,null,null,null,null,null,null,""]
[null,null,null,null,null,null,null,null,null,null,null,null,null,null,null,null,null,null,null,null,null,null,null,null,null,null,null,null,null,null,null,null,null,null,null,null,null,null,null,null,null,null,null,null,null,null,null,null,null,""]
[null,null,null,null,null,null,null,null,null,null,null,null,null,null,null,null,null,null,null,null,null,null,null,null,null,null,null,null,null,null,null,null,null,null,null,null,null,null,null,null,null,null,null,null,null,null,null,null,null,""]
[null,null,null,null,null,null,null,null,null,null,null,null,null,null,null,null,null,null,null,null,null,null,null,null,null,null,null,null,null,null,null,null,null,null,null,null,null,null,null,null,null,null,null,null,null,null,null,null,null,""]
[null,null,null,null,null,null,null,null,null,null,null,null,null,null,null,null,null,null,null,null,null,null,null,null,null,null,null,null,null,null,null,null,null,null,null,null,null,null,null,null,null,null,null,null,null,null,null,null,null,""]
[null,null,null,null,null,null,null,null,null,null,null,null,null,null,null,null,null,null,null,null,null,null,null,null,null,null,null,null,null,null,null,null,null,null,null,null,null,null,null,null,null,null,null,null,null,null,null,null,null,""]
[null,null,null,null,null,null,null,null,null,null,null,null,null,null,null,null,null,null,null,null,null,null,null,null,null,null,null,null,null,null,null,null,null,null,null,null,null,null,null,null,null,null,null,null,null,null,null,null,null,""]
[null,null,null,null,null,null,null,null,null,null,null,null,null,null,null,null,null,null,null,null,null,null,null,null,null,null,null,null,null,null,null,null,null,null,null,null,null,null,null,null,null,null,null,null,null,null,null,null,null,""]
[null,null,null,null,null,null,null,null,null,null,null,null,null,null,null,null,null,null,null,null,null,null,null,null,null,null,null,null,null,null,null,null,null,null,null,null,null,null,null,null,null,null,null,null,null,null,null,null,null,""]
[null,null,null,null,null,null,null,null,null,null,null,null,null,null,null,null,null,null,null,null,null,null,null,null,null,null,null,null,null,null,null,null,null,null,null,null,null,null,null,null,null,null,null,null,null,null,null,null,null,""]
[null,null,null,null,null,null,null,null,null,null,null,null,null,null,null,null,null,null,null,null,null,null,null,null,null,null,null,null,null,null,null,null,null,null,null,null,null,null,null,null,null,null,null,null,null,null,null,null,null,""]
[null,null,null,null,null,null,null,null,null,null,null,null,null,null,null,null,null,null,null,null,null,null,null,null,null,null,null,null,null,null,null,null,null,null,null,null,null,null,null,null,null,null,null,null,null,null,null,null,null,""]
[null,null,null,null,null,null,null,null,null,null,null,null,null,null,null,null,null,null,null,null,null,null,null,null,null,null,null,null,null,null,null,null,null,null,null,null,null,null,null,null,null,null,null,null,null,null,null,null,null,""]
[null,null,null,null,null,null,null,null,null,null,null,null,null,null,null,null,null,null,null,null,null,null,null,null,null,null,null,null,null,null,null,null,null,null,null,null,null,null,null,null,null,null,null,null,null,null,null,null,null,""]
[null,null,null,null,null,null,null,null,null,null,null,null,null,null,null,null,null,null,null,null,null,null,null,null,null,null,null,null,null,null,null,null,null,null,null,null,null,null,null,null,null,null,null,null,null,null,null,null,null,""]
[null,null,null,null,null,null,null,null,null,null,null,null,null,null,null,null,null,null,null,null,null,null,null,null,null,null,null,null,null,null,null,null,null,null,null,null,null,null,null,null,null,null,null,null,null,null,null,null,null,""]
[null,null,null,null,null,null,null,null,null,null,null,null,null,null,null,null,null,null,null,null,null,null,null,null,null,null,null,null,null,null,null,null,null,null,null,null,null,null,null,null,null,null,null,null,null,null,null,null,null,""]
[null,null,null,null,null,null,null,null,null,null,null,null,null,null,null,null,null,null,null,null,null,null,null,null,null,null,null,null,null,null,null,null,null,null,null,null,null,null,null,null,null,null,null,null,null,null,null,null,null,""]
[null,null,null,null,null,null,null,null,null,null,null,null,null,null,null,null,null,null,null,null,null,null,null,null,null,null,null,null,null,null,null,null,null,null,null,null,null,null,null,null,null,null,null,null,null,null,null,null,null,""]
[null,null,null,null,null,null,null,null,null,null,null,null,null,null,null,null,null,null,null,null,null,null,null,null,null,null,null,null,null,null,null,null,null,null,null,null,null,null,null,null,null,null,null,null,null,null,null,null,null,""]
[null,null,null,null,null,null,null,null,null,null,null,null,null,null,null,null,null,null,null,null,null,null,null,null,null,null,null,null,null,null,null,null,null,null,null,null,null,null,null,null,null,null,null,null,null,null,null,null,null,""]
[null,null,null,null,null,null,null,null,null,null,null,null,null,null,null,null,null,null,null,null,null,null,null,null,null,null,null,null,null,null,null,null,null,null,null,null,null,null,null,null,null,null,null,null,null,null,null,null,null,""]
[null,null,null,null,null,null,null,null,null,null,null,null,null,null,null,null,null,null,null,null,null,null,null,null,null,null,null,null,null,null,null,null,null,null,null,null,null,null,null,null,null,null,null,null,null,null,null,null,null,""]
[null,null,null,null,null,null,null,null,null,null,null,null,null,null,null,null,null,null,null,null,null,null,null,null,null,null,null,null,null,null,null,null,null,null,null,null,null,null,null,null,null,null,null,null,null,null,null,null,null,""]
[null,null,null,null,null,null,null,null,null,null,null,null,null,null,null,null,null,null,null,null,null,null,null,null,null,null,null,null,null,null,null,null,null,null,null,null,null,null,null,null,null,null,null,null,null,null,null,null,null,""]
[null,null,null,null,null,null,null,null,null,null,null,null,null,null,null,null,null,null,null,null,null,null,null,null,null,null,null,null,null,null,null,null,null,null,null,null,null,null,null,null,null,null,null,null,null,null,null,null,null,""]
[null,null,null,null,null,null,null,null,null,null,null,null,null,null,null,null,null,null,null,null,null,null,null,null,null,null,null,null,null,null,null,null,null,null,null,null,null,null,null,null,null,null,null,null,null,null,null,null,null,""]
[null,null,null,null,null,null,null,null,null,null,null,null,null,null,null,null,null,null,null,null,null,null,null,null,null,null,null,null,null,null,null,null,null,null,null,null,null,null,null,null,null,null,null,null,null,null,null,null,null,""]
[null,null,null,null,null,null,null,null,null,null,null,null,null,null,null,null,null,null,null,null,null,null,null,null,null,null,null,null,null,null,null,null,null,null,null,null,null,null,null,null,null,null,null,null,null,null,null,null,null,""]
[null,null,null,null,null,null,null,null,null,null,null,null,null,null,null,null,null,null,null,null,null,null,null,null,null,null,null,null,null,null,null,null,null,null,null,null,null,null,null,null,null,null,null,null,null,null,null,null,null,""]
[null,null,null,null,null,null,null,null,null,null,null,null,null,null,null,null,null,null,null,null,null,null,null,null,null,null,null,null,null,null,null,null,null,null,null,null,null,null,null,null,null,null,null,null,null,null,null,null,null,""]
[null,null,null,null,null,null,null,null,null,null,null,null,null,null,null,null,null,null,null,null,null,null,null,null,null,null,null,null,null,null,null,null,null,null,null,null,null,null,null,null,null,null,null,null,null,null,null,null,null,{"$f":"IFERROR(VLOOKUP(AO190,DataCycles,2,FALSE),\"\")","v":""}]
[null,null,null,null,null,null,null,null,null,null,null,null,null,null,null,null,null,null,null,null,null,null,null,null,null,null,null,null,null,null,null,null,null,null,null,null,null,null,null,null,null,null,null,null,null,null,null,null,null,""]
[null,null,null,null,null,null,null,null,null,null,null,null,null,null,null,null,null,null,null,null,null,null,null,null,null,null,null,null,null,null,null,null,null,null,null,null,null,null,null,null,null,null,null,null,null,null,null,null,null,""]
[null,null,null,null,null,null,null,null,null,null,null,null,null,null,null,null,null,null,null,null,null,null,null,null,null,null,null,null,null,null,null,null,null,null,null,null,null,null,null,null,null,null,null,null,null,null,null,null,null,""]
[null,null,null,null,null,null,null,null,null,null,null,null,null,null,null,null,null,null,null,null,null,null,null,null,null,null,null,null,null,null,null,null,null,null,null,null,null,null,null,null,null,null,null,null,null,null,null,null,null,""]
[null,null,null,null,null,null,null,null,null,null,null,null,null,null,null,null,null,null,null,null,null,null,null,null,null,null,null,null,null,null,null,null,null,null,null,null,null,null,null,null,null,null,null,null,null,null,null,null,null,""]
[null,null,null,null,null,null,null,null,null,null,null,null,null,null,null,null,null,null,null,null,null,null,null,null,null,null,null,null,null,null,null,null,null,null,null,null,null,null,null,null,null,null,null,null,null,null,null,null,null,""]
[null,null,null,null,null,null,null,null,null,null,null,null,null,null,null,null,null,null,null,null,null,null,null,null,null,null,null,null,null,null,null,null,null,null,null,null,null,null,null,null,null,null,null,null,null,null,null,null,null,""]
[null,null,null,null,null,null,null,null,null,null,null,null,null,null,null,null,null,null,null,null,null,null,null,null,null,null,null,null,null,null,null,null,null,null,null,null,null,null,null,null,null,null,null,null,null,null,null,null,null,""]
[null,null,null,null,null,null,null,null,null,null,null,null,null,null,null,null,null,null,null,null,null,null,null,null,null,null,null,null,null,null,null,null,null,null,null,null,null,null,null,null,null,null,null,null,null,null,null,null,null,""]
[null,null,null,null,null,null,null,null,null,null,null,null,null,null,null,null,null,null,null,null,null,null,null,null,null,null,null,null,null,null,null,null,null,null,null,null,null,null,null,null,null,null,null,null,null,null,null,null,null,""]
[null,null,null,null,null,null,null,null,null,null,null,null,null,null,null,null,null,null,null,null,null,null,null,null,null,null,null,null,null,null,null,null,null,null,null,null,null,null,null,null,null,null,null,null,null,null,null,null,null,""]
[null,null,null,null,null,null,null,null,null,null,null,null,null,null,null,null,null,null,null,null,null,null,null,null,null,null,null,null,null,null,null,null,null,null,null,null,null,null,null,null,null,null,null,null,null,null,null,null,null,""]
[null,null,null,null,null,null,null,null,null,null,null,null,null,null,null,null,null,null,null,null,null,null,null,null,null,null,null,null,null,null,null,null,null,null,null,null,null,null,null,null,null,null,null,null,null,null,null,null,null,""]
[null,null,null,null,null,null,null,null,null,null,null,null,null,null,null,null,null,null,null,null,null,null,null,null,null,null,null,null,null,null,null,null,null,null,null,null,null,null,null,null,null,null,null,null,null,null,null,null,null,""]
[null,null,null,null,null,null,null,null,null,null,null,null,null,null,null,null,null,null,null,null,null,null,null,null,null,null,null,null,null,null,null,null,null,null,null,null,null,null,null,null,null,null,null,null,null,null,null,null,null,""]
[null,null,null,null,null,null,null,null,null,null,null,null,null,null,null,null,null,null,null,null,null,null,null,null,null,null,null,null,null,null,null,null,null,null,null,null,null,null,null,null,null,null,null,null,null,null,null,null,null,""]
[null,null,null,null,null,null,null,null,null,null,null,null,null,null,null,null,null,null,null,null,null,null,null,null,null,null,null,null,null,null,null,null,null,null,null,null,null,null,null,null,null,null,null,null,null,null,null,null,null,""]
[null,null,null,null,null,null,null,null,null,null,null,null,null,null,null,null,null,null,null,null,null,null,null,null,null,null,null,null,null,null,null,null,null,null,null,null,null,null,null,null,null,null,null,null,null,null,null,null,null,""]
[null,null,null,null,null,null,null,null,null,null,null,null,null,null,null,null,null,null,null,null,null,null,null,null,null,null,null,null,null,null,null,null,null,null,null,null,null,null,null,null,null,null,null,null,null,null,null,null,null,""]
[null,null,null,null,null,null,null,null,null,null,null,null,null,null,null,null,null,null,null,null,null,null,null,null,null,null,null,null,null,null,null,null,null,null,null,null,null,null,null,null,null,null,null,null,null,null,null,null,null,""]
[null,null,null,null,null,null,null,null,null,null,null,null,null,null,null,null,null,null,null,null,null,null,null,null,null,null,null,null,null,null,null,null,null,null,null,null,null,null,null,null,null,null,null,null,null,null,null,null,null,""]
[null,null,null,null,null,null,null,null,null,null,null,null,null,null,null,null,null,null,null,null,null,null,null,null,null,null,null,null,null,null,null,null,null,null,null,null,null,null,null,null,null,null,null,null,null,null,null,null,null,""]
[null,null,null,null,null,null,null,null,null,null,null,null,null,null,null,null,null,null,null,null,null,null,null,null,null,null,null,null,null,null,null,null,null,null,null,null,null,null,null,null,null,null,null,null,null,null,null,null,null,""]
[null,null,null,null,null,null,null,null,null,null,null,null,null,null,null,null,null,null,null,null,null,null,null,null,null,null,null,null,null,null,null,null,null,null,null,null,null,null,null,null,null,null,null,null,null,null,null,null,null,""]
[null,null,null,null,null,null,null,null,null,null,null,null,null,null,null,null,null,null,null,null,null,null,null,null,null,null,null,null,null,null,null,null,null,null,null,null,null,null,null,null,null,null,null,null,null,null,null,null,null,""]
[null,null,null,null,null,null,null,null,null,null,null,null,null,null,null,null,null,null,null,null,null,null,null,null,null,null,null,null,null,null,null,null,null,null,null,null,null,null,null,null,null,null,null,null,null,null,null,null,null,""]
[null,null,null,null,null,null,null,null,null,null,null,null,null,null,null,null,null,null,null,null,null,null,null,null,null,null,null,null,null,null,null,null,null,null,null,null,null,null,null,null,null,null,null,null,null,null,null,null,null,""]
[]
[]
[null,null,"RETURN COMPLETED FORM TO REGISTRATION@NGOLOCALPAY.NET"]
[]
[]
[null,null,"To complete your order, SAVE THIS FILE. "]
[]
[null,null,null,null,"Then, send an email to:",null,null,null,null,null,null,null,null,null,"registration@birchesgroup.com",null,null,null,null,null,null,null,null,null,null,null,null,"and ATTACH THIS FILE to your email."]
[]
[]
[null,null,"© 2013 Birches Group LLC"]

{"sheet":"Order Form (SC)","index":5,"n_rows":175,"n_cols":152,"rows_kept":175,"cut":false,"hidden":false,"merged":[[163,40,163,48],[153,49,154,56],[155,49,155,56],[156,49,156,56],[157,49,157,56],[158,49,158,56],[159,49,159,56],[160,49,160,56],[161,49,161,56],[162,49,162,56],[163,49,163,56],[158,40,158,48],[159,40,159,48],[160,40,160,48],[161,40,161,48],[162,40,162,48],[155,40,155,48],[153,40,154,48],[156,40,156,48],[157,40,157,48],[51,84,51,94],[51,95,51,112],[51,113,51,121],[51,122,51,123],[51,124,51,133],[49,72,49,73],[49,75,49,77],[17,2,17,12],[17,25,17,26],[17,27,17,36],[17,39,17,57],[19,2,19,11],[19,14,19,23],[19,27,19,36],[19,39,19,57],[23,2,23,5],[23,6,23,23],[23,27,23,30],[23,31,23,36],[23,44,23,57],[31,2,31,11],[31,14,31,23],[31,27,31,36],[31,39,31,57],[34,6,34,23],[34,31,34,57],[24,2,24,13],[24,14,24,23],[28,2,28,23],[9,1,9,57],[10,2,10,57],[11,2,12,57],[14,2,14,57],[16,2,16,23],[16,25,16,26],[16,27,16,36],[16,39,16,57],[22,2,22,5],[22,6,22,23],[22,27,22,30],[22,31,22,57],[28,25,28,26],[28,27,28,36],[28,39,28,57],[40,2,40,7],[40,8,40,17],[43,3,43,54],[45,3,45,55],[46,3,46,55],[49,3,49,52],[35,6,35,23],[35,31,35,36],[35,44,35,57],[36,14,36,23],[38,27,38,57],[41,8,41,17],[39,2,39,7],[39,8,39,17],[39,18,39,23],[38,2,38,23],[40,18,40,23],[54,12,54,15],[52,3,52,10],[52,12,52,15],[53,12,53,15],[51,3,51,10],[51,12,51,15],[51,17,51,24],[56,12,56,15],[55,12,55,15],[58,12,58,15],[57,12,57,15],[57,30,57,34],[58,30,58,34],[57,25,57,28],[58,25,58,28],[57,35,57,42],[58,35,58,42],[55,30,55,34],[56,30,56,34],[55,25,55,28],[56,25,56,28],[55,35,55,42],[56,35,56,42],[61,30,61,34],[61,35,61,42],[60,12,60,15],[59,12,59,15],[59,30,59,34],[60,30,60,34],[59,25,59,28],[60,25,60,28],[59,35,59,42],[60,35,60,42],[65,12,65,15],[65,17,65,24],[65,32,65,40],[65,41,65,42],[65,43,65,50],[65,52,65,56],[61,25,61,28],[64,12,64,15],[64,17,64,24],[64,32,64,40],[64,41,64,42],[64,43,64,50],[64,52,64,56],[63,12,63,15],[63,17,63,24],[63,32,63,40],[63,41,63,42],[63,43,63,50],[63,52,63,56],[62,12,62,15],[62,17,62,24],[62,32,62,40],[62,41,62,42],[61,12,61,15],[67,12,67,15],[67,17,67,24],[67,32,67,40],[67,41,67,42],[67,43,67,50],[67,52,67,56],[66,12,66,15],[66,17,66,24],[66,32,66,40],[66,41,66,42],[66,43,66,50],[66,52,66,56],[69,12,69,15],[69,17,69,24],[69,32,69,40],[69,41,69,42],[69,43,69,50],[69,52,69,56],[68,12,68,15],[68,17,68,24],[68,32,68,40],[68,41,68,42],[68,43,68,50],[68,52,68,56],[71,12,71,15],[71,17,71,24],[71,32,71,40],[71,41,71,42],[71,43,71,50],[71,52,71,56],[70,12,70,15],[70,17,70,24],[70,32,70,40],[70,41,70,42],[70,43,70,50],[70,52,70,56],[73,12,73,15],[73,17,73,24],[73,32,73,40],[73,41,73,42],[73,43,73,50],[73,52,73,56],[72,12,72,15],[72,17,72,24],[72,32,72,40],[72,41,72,42],[72,43,72,50],[72,52,72,56],[75,12,75,15],[75,17,75,24],[75,32,75,40],[75,41,75,42],[75,43,75,50],[75,52,75,56],[74,12,74,15],[74,17,74,24],[74,32,74,40],[74,41,74,42],[74,43,74,50],[74,52,74,56],[77,12,77,15],[77,17,77,24],[77,32,77,40],[77,41,77,42],[77,43,77,50],[77,52,77,56],[76,12,76,15],[76,17,76,24],[76,32,76,40],[76,41,76,42],[76,43,76,50],[76,52,76,56],[79,12,79,15],[79,17,79,24],[79,32,79,40],[79,41,79,42],[79,43,79,50],[79,52,79,56],[78,12,78,15],[78,17,78,24],[78,32,78,40],[78,41,78,42],[78,43,78,50],[78,52,78,56],[81,12,81,15],[81,17,81,24],[81,32,81,40],[81,41,81,42],[81,43,81,50],[81,52,81,56],[80,12,80,15],[80,17,80,24],[80,32,80,40],[80,41,80,42],[80,43,80,50],[80,52,80,56],[83,12,83,15],[83,17,83,24],[83,32,83,40],[83,41,83,42],[83,43,83,50],[83,52,83,56],[82,12,82,15],[82,17,82,24],[82,32,82,40],[82,41,82,42],[82,43,82,50],[82,52,82,56],[85,12,85,15],[85,17,85,24],[85,32,85,40],[85,41,85,42],[85,43,85,50],[85,52,85,56],[84,12,84,15],[84,17,84,24],[84,32,84,40],[84,41,84,42],[84,43,84,50],[84,52,84,56],[87,12,87,15],[87,17,87,24],[87,32,87,40],[87,41,87,42],[87,43,87,50],[87,52,87,56],[86,12,86,15],[86,17,86,24],[86,32,86,40],[86,41,86,42],[86,43,86,50],[86,52,86,56],[89,12,89,15],[89,17,89,24],[89,32,89,40],[89,41,89,42],[89,43,89,50],[89,52,89,56],[88,12,88,15],[88,17,88,24],[88,32,88,40],[88,41,88,42],[88,43,88,50],[88,52,88,56],[91,12,91,15],[91,17,91,24],[91,32,91,40],[91,41,91,42],[91,43,91,50],[91,52,91,56],[90,12,90,15],[90,17,90,24],[90,32,90,40],[90,41,90,42],[90,43,90,50],[90,52,90,56],[93,12,93,15],[93,17,93,24],[93,32,93,40],[93,41,93,42],[93,43,93,50],[93,52,93,56],[92,12,92,15],[92,17,92,24],[92,32,92,40],[92,41,92,42],[92,43,92,50],[92,52,92,56],[95,12,95,15],[95,17,95,24],[95,32,95,40],[95,41,95,42],[95,43,95,50],[95,52,95,56],[94,12,94,15],[94,17,94,24],[94,32,94,40],[94,41,94,42],[94,43,94,50],[94,52,94,56],[97,12,97,15],[97,17,97,24],[97,32,97,40],[97,41,97,42],[97,43,97,50],[97,52,97,56],[96,12,96,15],[96,17,96,24],[96,32,96,40],[96,41,96,42],[96,43,96,50],[96,52,96,56],[99,12,99,15],[99,17,99,24],[99,32,99,40],[99,41,99,42],[99,43,99,50],[99,52,99,56],[98,12,98,15],[98,17,98,24],[98,32,98,40],[98,41,98,42],[98,43,98,50],[98,52,98,56],[101,12,101,15],[101,17,101,24],[101,32,101,40],[101,41,101,42],[101,43,101,50],[101,52,101,56],[100,12,100,15],[100,17,100,24],[100,32,100,40],[100,41,100,42],[100,43,100,50],[100,52,100,56],[103,12,103,15],[103,17,103,24],[103,32,103,40],[103,41,103,42],[103,43,103,50],[103,52,103,56],[102,12,102,15],[102,17,102,24],[102,32,102,40],[102,41,102,42],[102,43,102,50],[102,52,102,56],[105,12,105,15],[105,17,105,24],[105,32,105,40],[105,41,105,42],[105,43,105,50],[105,52,105,56],[104,12,104,15],[104,17,104,24],[104,32,104,40],[104,41,104,42],[104,43,104,50],[104,52,104,56],[107,12,107,15],[107,17,107,24],[107,32,107,40],[107,41,107,42],[107,43,107,50],[107,52,107,56],[106,12,106,15],[106,17,106,24],[106,32,106,40],[106,41,106,42],[106,43,106,50],[106,52,106,56],[109,12,109,15],[109,17,109,24],[109,32,109,40],[109,41,109,42],[109,43,109,50],[109,52,109,56],[108,12,108,15],[108,17,108,24],[108,32,108,40],[108,41,108,42],[108,43,108,50],[108,52,108,56],[111,12,111,15],[111,17,111,24],[111,32,111,40],[111,41,111,42],[111,43,111,50],[111,52,111,56],[110,12,110,15],[110,17,110,24],[110,32,110,40],[110,41,110,42],[110,43,110,50],[110,52,110,56],[114,12,114,15],[114,17,114,23],[115,6,115,10],[115,17,115,23],[114,25,114,29],[114,30,114,34],[114,48,114,55],[115,11,115,16],[112,12,112,15],[112,17,112,24],[112,32,112,40],[112,41,112,42],[112,43,112,50],[112,52,112,56],[117,3,117,10],[117,17,117,23],[116,3,116,10],[116,17,116,23],[115,25,115,29],[115,30,115,34],[116,25,116,29],[116,30,116,34],[117,25,117,29],[117,30,117,34],[116,11,116,16],[117,11,117,16],[129,2,129,57],[130,2,130,57],[131,2,131,57],[133,2,133,57],[134,2,134,57],[135,2,135,57],[118,3,118,10],[128,2,128,57],[124,4,124,19],[124,20,124,25],[125,4,125,19],[125,20,125,25],[124,31,124,55],[124,28,124,30],[118,11,118,16],[136,2,136,57],[139,2,139,57],[140,2,146,57],[149,3,149,57],[150,3,150,57],[153,31,154,39],[154,4,154,12],[154,13,154,21],[154,22,154,30],[151,3,151,39],[157,4,157,12],[157,13,157,21],[157,22,157,30],[157,31,157,39],[158,4,158,12],[158,13,158,21],[158,22,158,30],[158,31,158,39],[155,4,155,12],[155,13,155,21],[155,22,155,30],[155,31,155,39],[156,4,156,12],[156,13,156,21],[156,22,156,30],[156,31,156,39],[162,13,162,21],[162,22,162,30],[162,31,162,39],[159,4,159,12],[159,13,159,21],[159,22,159,30],[159,31,159,39],[160,4,160,12],[160,13,160,21],[160,22,160,30],[160,31,160,39],[51,35,51,42],[52,35,52,42],[53,35,53,42],[54,35,54,42],[166,2,166,57],[169,2,169,57],[171,14,171,25],[51,30,51,34],[52,25,52,29],[52,30,52,34],[51,25,51,29],[53,30,53,34],[54,30,54,34],[53,25,53,28],[54,25,54,28],[163,4,163,12],[163,13,163,21],[163,22,163,30],[163,31,163,39],[161,4,161,12],[161,13,161,21],[161,22,161,30],[161,31,161,39],[162,4,162,12],[49,63,49,67],[49,68,49,71],[116,48,116,55],[116,43,116,47],[117,48,117,55],[117,43,117,47],[115,48,115,55],[115,43,115,47],[114,43,114,47],[62,43,62,47],[51,43,51,47],[115,59,115,66],[115,67,115,72],[53,43,53,47],[54,43,54,47],[55,43,55,47],[56,43,56,47],[57,43,57,47],[58,43,58,47],[59,43,59,47],[60,43,60,47],[61,43,61,47]]}
[]
[]
[]
[]
[]
[]
[]
[]
[]
[null,"Community™ Market Compensation & Benefits Survey"]
[null,null,"Registration Form for NGOs and Commercial Development Organizations"]
[null,null,"Please fill out this form completely in order to ensure your subscription can be processed quickly"]
[]
[]
[]
[null,null,"Purchase Authorized by"]
[null,null,{"$f":"IF(ISBLANK(OrgName),\"\",OrgName)","v":""},null,null,null,null,null,null,null,null,null,null,null,null,null,null,null,null,null,null,null,null,null,null,{"$f":"IF(ISBLANK(SubscriberSalutation),\"\",SubscriberSalutation)","v":""},null,{"$f":"IF(ISBLANK(SubscriberFirstName),\"\",SubscriberFirstName)","v":""},null,null,null,null,null,null,null,null,null,null,null,{"$f":"IF(ISBLANK(SubscriberLastName),\"\",SubscriberLastName)","v":""}]
[null,null,"Organization (Subscriber)",null,null,null,null,null,null,null,null,null,null,null,null,null,null,null,null,null,null,null,null,null,null,"Title",null,"Given Name(s)",null,null,null,null,null,null,null,null,null,null,null,"Surname(s)"]
[]
[null,null,{"$f":"IF(ISBLANK(SubscriberTitle),\"\",SubscriberTitle)","v":""},null,null,null,null,null,null,null,null,null,null,null,{"$f":"IF(ISBLANK(SubscriberEmail),\"\",SubscriberEmail)","v":""},null,null,null,null,null,null,null,null,null,null,null,null,{"$f":"IF(ISBLANK(SubscriberPhone),\"\",SubscriberPhone)","v":""},null,null,null,null,null,null,null,null,null,null,null,{"$f":"IF(ISBLANK(SubscriberSkype),\"\",SubscriberSkype)","v":""}]
[null,null,"Job Title",null,null,null,null,null,null,null,null,null,null,null,"Email",null,null,null,null,null,null,null,null,null,null,null,null,"Phone (including country code)",null,null,null,null,null,null,null,null,null,null,null,"Skype Address"]
[]
[null,null,"Address 1",null,null,null,{"$f":"IF(ISBLANK(SubscriberAddress1),\"\",SubscriberAddress1)","v":""},null,null,null,null,null,null,null,null,null,null,null,null,null,null,null,null,null,null,null,null,"Address 2",null,null,null,{"$f":"IF(ISBLANK(SubscriberAddress2),\"\",SubscriberAddress2)","v":""}]
[null,null,"City",null,null,null,{"$f":"IF(ISBLANK(SubscriberCity),\"\",SubscriberCity)","v":""},null,null,null,null,null,null,null,null,null,null,null,null,null,null,null,null,null,null,null,null,"Country",null,null,null,{"$f":"IF(ISBLANK(SubscriberCountry),\"\",SubscriberCountry)","v":""},null,null,null,null,null,null,null,"Postal Code",null,null,null,null,{"$f":"IF(ISBLANK(SubscriberPostalCode),\"\",SubscriberPostalCode)","v":""}]
[null,null,"State/Province (US/Canada only)",null,null,null,null,null,null,null,null,null,null,null,{"$f":"IF(ISBLANK(SubscriberState),\"\",SubscriberState)","v":""}]
[]
[]
[null,null,"Billing Contact Information (if different than purchaser)"]
[null,null,{"$f":"IF(ISBLANK(BillingOrgName),\"\",BillingOrgName)","v":""},null,null,null,null,null,null,null,null,null,null,null,null,null,null,null,null,null,null,null,null,null,null,{"$f":"IF(ISBLANK(BillingSalutation),\"\",BillingSalutation)","v":""},null,{"$f":"IF(ISBLANK(BillingGivenNames),\"\",BillingGivenNames)","v":""},null,null,null,null,null,null,null,null,null,null,null,{"$f":"IF(ISBLANK(BillingSurnames),\"\",BillingSurnames)","v":""}]
[null,null,"Company",null,null,null,null,null,null,null,null,null,null,null,null,null,null,null,null,null,null,null,null,null,null,"Title",null,"Given Name(s)",null,null,null,null,null,null,null,null,null,null,null,"Surname(s)"]
[]
[null,null,{"$f":"IF(ISBLANK(BillingJobTitle),\"\",BillingJobTitle)","v":""},null,null,null,null,null,null,null,null,null,null,null,{"$f":"IF(ISBLANK(BillingEmail),\"\",BillingEmail)","v":""},null,null,null,null,null,null,null,null,null,null,null,null,{"$f":"IF(ISBLANK(BillingPhone),\"\",BillingPhone)","v":""},null,null,null,null,null,null,null,null,null,null,null,{"$f":"IF(ISBLANK(BillingSkype),\"\",BillingSkype)","v":""}]
[null,null,"Job Title",null,null,null,null,null,null,null,null,null,null,null,"Email",null,null,null,null,null,null,null,null,null,null,null,null,"Phone (including country code)",null,null,null,null,null,null,null,null,null,null,null,"Skype Address"]
[]
[null,null,"Address 1",null,null,null,{"$f":"IF(ISBLANK(BillingAddress1),\"\",BillingAddress1)","v":""},null,null,null,null,null,null,null,null,null,null,null,null,null,null,null,null,null,null,null,null,"Address 2",null,null,null,{"$f":"IF(ISBLANK(BillingAddress2),\"\",BillingAddress2)","v":""}]
[null,null,"City",null,null,null,{"$f":"IF(ISBLANK(BillingCity),\"\",BillingCity)","v":""},null,null,null,null,null,null,null,null,null,null,null,null,null,null,null,null,null,null,null,null,"Country",null,null,null,{"$f":"IF(ISBLANK(BillingCountry),\"\",BillingCountry)","v":""},null,null,null,null,null,null,null,"Postal Code",null,null,null,null,{"$f":"IF(ISBLANK(BillingPostalCode),\"\",BillingPostalCode)","v":""}]
[null,null,"State/Province (US/Canada only)",null,null,null,null,null,null,null,null,null,null,null,{"$f":"IF(ISBLANK(BillingState),\"\",BillingState)","v":""}]
[]
[null,null,"(Birches Group use only)",null,null,null,null,null,null,null,null,null,null,null,null,null,null,null,null,null,null,null,null,null,null,null,null,{"$f":"IF(ISBLANK(PurchaseOrderNo),\"\",PurchaseOrderNo)","v":""}]
[null,null,"Account Number",null,null,null,null,null,{"$f":"AccountNumber","v":0},null,null,null,null,null,null,null,null,null,{"$f":"'Order Form'!U61","v":"USD"},null,null,null,null,null,null,null,null,"Purchase Order Number (optional)"]
[null,null,"Order Number:",null,null,null,null,null,{"$f":"OrderNumber","v":0},null,null,null,null,null,null,null,null,null,{"$f":"PriorPrice","v":"No"}]
[null,null,"Effective Date:",null,null,null,null,null,{"$f":"'Order Form'!SubscriptionStartDate","v":"00:00:00"}]
[]
[null,null,null,"For each of the countries you have selected, please indicate the following information:",null,null,null,null,null,null,null,null,null,null,null,null,null,null,null,null,null,null,null,null,null,null,null,null,null,null,null,null,null,null,null,null,null,null,null,null,null,null,null,null,null,null,null,null,null,null,null,null,null,null,null,null,null,null,null,null,null,null,null,null,null,null,null,null,null,null,null,null,null,null,null,null,null,null,null,null,null,null,null,null,"Export area for Reg Database",null,null,null,null,null,null,null,null,null,null,null,null,null,null,null,null,null,null,null,null,null,null,null,null,null,null,null,null,null,null,null,null,null,null,null,null,null,null,null,null,null,null,null,null,null,null,null,null,null,null,null,null,null,null,null,null,"These are working columns, will be hidden when finished with coding"]
[]
[null,null,null,"  1)  Data Submission.  Indicate Yes or No for Data Submission.  Note there is an additional fee if you do not submit your data,",null,null,null,null,null,null,null,null,null,null,null,null,null,null,null,null,null,null,null,null,null,null,null,null,null,null,null,null,null,null,null,null,null,null,null,null,null,null,null,null,null,null,null,null,null,null,null,null,null,null,null,null,null,null,null,null,null,null,null,"Organization Name","Account Number","Order Number","Billing Contact","Billing Title","Address1","Address2","Billing State","Billing City","Billing Postal Code","Billing Country","Billing Phone","Billing E-Mail","Organization Type","Subscription Type","Subscription Start Date","Subscription End Date","Currency"]
[null,null,null,"  2)  Custom Cut.  For each country, indicate if you would like to add a Custom Cut to your subscription.",null,null,null,null,null,null,null,null,null,null,null,null,null,null,null,null,null,null,null,null,null,null,null,null,null,null,null,null,null,null,null,null,null,null,null,null,null,null,null,null,null,null,null,null,null,null,null,null,null,null,null,null,null,null,null,null,null,null,null,{"$f":"C17","v":""},{"$f":"AccountNumber","v":0},{"$f":"I41","v":0},{"$f":"IF(AB29=\"\",Z17&\" \"&AB17&\" \"&AN17,Z29&\" \"&AB29&\" \"&AN29)","v":"  "},{"$f":"IF(C32=\"\",C20,C32)","v":""},{"$f":"IF(G35=\"\",G23,G35)","v":""},{"$f":"IF(AF35=\"\",AF23,AF35)","v":""},{"$f":"IF(O37=\"\",IF(O25=\"\",\"\", \", \"&VLOOKUP(O25,StateAbbr,2,FALSE)), \", \"&VLOOKUP(O37,StateAbbr,2,FALSE))","v":""},{"$f":"IF(G36=\"\",G24,G36)","v":""},{"$f":"IF(AS36=\"\",AS24,AS36)","v":""},{"$f":"IF(AF36=\"\",AF24,AF36)","v":""},{"$f":"IF(AB32=\"\",AB20,AB32)","v":""},{"$f":"IF(O32=\"\",O20,O32)","v":""},{"$f":"'Order Form'!L101","v":"Type of Organization"},{"$f":"ProductOption","v":"Product Option"},{"$f":"'Order Form'!SubscriptionStartDate","v":"00:00:00"},{"$f":"DATE(YEAR(CA47)+3,MONTH(CA47),DAY(CA47))-1","v":"1902-12-30"},{"$f":"Currency","v":"USD"}]
[null,null,null,null,null,null,null,null,null,null,null,null,null,null,null,null,null,null,null,null,null,null,null,null,null,null,null,null,null,null,null,null,null,null,null,null,null,null,null,null,null,null,null,null,null,null,null,null,null,null,null,null,null,null,null,null,null,null,null,null,null,null,null,null,null,null,null,null,null,null,null,null,null,null,null,"Billing Year",{"$f":"IF(TODAY()>CA47+730,\"Year 3\",IF(TODAY()>CA47+365,\"Year 2\",\"Year 1\"))","v":"Year 3"}]
[null,null,null,null,null,null,null,null,null,null,null,null,null,null,null,null,null,null,null,null,null,null,null,null,null,null,null,null,null,null,null,null,null,null,null,null,null,null,null,null,null,null,null,null,null,null,null,null,null,null,null,null,null,null,null,null,null,null,null,null,null,null,null,"cc Emails",null,null,null,null,"Sales Rep"]
[null,null,null,"Note:  You can use copy/paste commands, or drag values down, to copy information to multiple lines.",null,null,null,null,null,null,null,null,null,null,null,null,null,null,null,null,null,null,null,null,null,null,null,null,null,null,null,null,null,null,null,null,null,null,null,null,null,null,null,null,null,null,null,null,null,null,null,null,null,null,null,null,null,null,null,null,null,null,null,{"$f":"ccemails","v":0},null,null,null,null,{"$f":"IF(ISBLANK(SalesRep),\"support@birchesgroup.com\",SalesRep)","v":"support@birchesgroup.com"},null,null,null,{"$f":"IF(NGOGPChoice=\"no\",\"\",\"Data:NGO Global Pay:Sustaining Contributor\")","v":""},null,{"$f":"IF(NGOGPChoice=\"No\",\"\",NGOGlobalPayFee)","v":""},{"$f":"IF(M63=\"No\",\"Data:NGO Global Pay:Non-Participant Surcharge\",\"\")","v":""},null,null,{"$f":"AR63","v":0}]
[null,null,null,null,null,null,null,null,null,null,null,null,null,null,null,null,null,null,null,null,null,null,null,null,null,null,null,null,null,null,null,null,null,null,null,null,null,null,null,null,null,null,null,null,null,null,null,null,null,null,null,null,null,null,null,null,null,null,null,null,null,null,null,"Tax Gross-Up",{"$f":"U126","v":0}]
[null,null,null,"Country",null,null,null,null,null,null,null,null,"Will You Submit Data (Y/N)?",null,null,null,null,{"$f":"CONCATENATE(\"     Profiles Available             Cost per Country                 (\",TEXT(FirstYr, \"$#,##0\"),\" 1st Yr,                  \",TEXT(SecondYr,\"$#,##0\"),\" 2nd Yr,                \",TEXT(ThirdYr,\"$#,##0\"),\" 3rd Yr)\" )","v":{"$error":"#N/A"}},null,null,null,null,null,null,null,{"$f":"\"Multisector \nAdd-on\"&\" (\"&\nTEXT(MSAddOn,\"$#,##0\")&\")\"","v":{"$error":"#N/A"}},null,null,null,null,{"$f":"\"Indigo™\nAdd-on (\"&TEXT(Indigo,\"$#,##0\")&\")\"","v":{"$error":"#N/A"}},null,null,null,null,"Custom Cuts",null,null,null,null,null,null,null,"Non-Participation Surcharge\n(50% of survey fees)",null,null,null,null,null,null,null,null,null,null,null,null,null,null,null,null,null,null,null,null,null,null,null,null,null,null,null,null,null,null,null,null,null,null,null,null,null,null,null,null,"Information about the person who responded ",null,null,null,null,null,null,null,null,null,null,"Survey Data Contacts",null,null,null,null,null,null,null,null,null,null,null,null,null,null,null,null,null,"HQ/Regional Contacts",null,null,null,null,null,null,null,null,"Survey\nAccess",null,"Billing"]
[null,null,null,null,null,null,null,null,null,null,null,null,"choose",null,null,null,null,null,null,null,null,null,null,null,null,"choose",null,null,null,null,"choose",null,null,null,null,"choose",null,null,null,null,null,null,null,null,null,null,null,null,null,null,null,null,null,null,null,null,null,null,null,null,null,null,null,"Organization Name","Order Number","Class","Data:Multi-year Indigo Purchase:Sustaining Contributor","Data:Annual Report Purchase:Indigo Add-On","Data:Annual Report Purchase:Multisector Add On","Custom Cut Description","Data:Specialized Data:Custom Cut","SubsectorName","Data:Specialized Data:Subsector Cut","Data:General Fees:Non-Participant Fee","Group Total","Billing Period StartDate","Billing Period End Date",null,null,null,null,null,null,null,"Date Registered","Salutation (Mr/Ms)","First or Given Name","Last or Family Name","Name of Organization","Your Job Title","Country in which you are Located","Phone number (including country code)","Email Address","Skype Address","Number of Countries:","Country Name","Salutation (Mr/Ms)","First or Given Name","Last or Family Name","Name of Organization","Job Title","Country","Phone number (including country code)","Email Address","Skype Address - LCL","Response","EE Threshold","Next Pay Review Date","Pay Review Frequency","Survey Year","Country-Year","Survey Status","UniqueKey","Salutation (Mr/Ms)","First or Given Name","Last or Family Name","Name of Organization","Job Title","Country","Phone number (including country code)","Email Address","Skype Address - HQ","Name","E-mail Address","Send invoice to","Salutation (Mr/Ms)","First or Given Name","Last or Family Name","Name of Organization","Job Title","Country","Phone number (including country code)","Email Address","Skype Address - Billing","Notes","Response","Will provide data?","Preferred Partner?","Fee applies",null,null,"Main Product","Start Date","End Date","Pricing","Indigo™","MS Add-on","Custom Cut","Subsector (Subsector Name)","Participate"]
[null,null,1,null,null,null,null,null,null,null,null,null,null,null,null,null,null,{"$f":"IF(ISNA(VLOOKUP($D54,SurveyElections,2,FALSE)),\"\",VLOOKUP($D54,SurveyElections,2,FALSE))","v":""},null,null,null,null,null,null,null,null,null,null,null,{"$f":"IF(AND(Z54=\"x\",R54=\"NGOLP & Multisector\"),1,0)","v":0},null,null,null,null,null,null,null,null,null,null,null,null,null,{"$f":"IFERROR(ROUND(IF(ISBLANK(D54),\"\",IF(M54=\"Yes\",0,NGOLPSurvey*0.5)),0),\"\")","v":""},null,null,null,null,null,null,null,null,null,null,null,null,null,null,null,null,null,null,null,{"$f":"OrgName","v":0},{"$f":"OrderNumber","v":0},{"$f":"IF(ISBLANK(D54),\"\",D54)","v":""},{"$f":"IF(ISBLANK(D54),\"\",IF(BY$48=\"Year 3\",ThirdYr,FirstYr))","v":""},{"$f":"IF(ISBLANK(AE54),\"\",Indigo)","v":""},{"$f":"AD54*MSAddOn","v":{"$error":"#N/A"}},{"$f":"IF(ISBLANK(AJ54),\"\",AJ54)","v":""},{"$f":"IF(AJ54=\"All Cycles\",CustomAll,0)+IF(OR(AJ54=\"Cycle 1 (Apr)\", AJ54=\"Cycle 2 (Jul)\", AJ54=\"Cycle 3 (Oct)\"),Custom,0)","v":0},null,null,{"$f":"IF(M54=\"Yes\",\"\",AR54)","v":""},{"$f":"SUM(BV54,BO54,BS54,BU54,BP54,BQ54)","v":{"$error":"#N/A"}},{"$f":"IF($BY$48=\"Year 1\",$CA$47,IF($BY$48=\"Year 2\",EDATE($CA$47,12),EDATE($CA$47,24)))","v":"1901-12-31"},{"$f":"IF(BX54=\"\",\"\",DATE(YEAR(BX54)+1,MONTH(BX54),DAY(BX54)-1))","v":"1902-12-30"},null,null,null,null,null,null,null,{"$f":"TODAY()","v":"2021-03-18"},{"$f":"$Z$17","v":""},{"$f":"$AB$17","v":""},{"$f":"$AN$17","v":""},{"$f":"$C$17","v":""},{"$f":"$C$20","v":""},{"$f":"$AF$24","v":""},{"$f":"$AB$20","v":""},{"$f":"$O$20","v":""},{"$f":"$AN$20","v":""},{"$f":"TotalIndigo","v":0},{"$f":"D54","v":0},{"$f":"VLOOKUP($CR54,SurveyDataContacts,'Survey Contacts'!$L$24,FALSE)","v":{"$error":"#N/A"}},{"$f":"VLOOKUP($CR54,SurveyDataContacts,'Survey Contacts'!$T$24,FALSE)","v":{"$error":"#N/A"}},{"$f":"VLOOKUP($CR54,SurveyDataContacts,'Survey Contacts'!$AL$24,FALSE)","v":{"$error":"#N/A"}},{"$f":"CK54","v":""},{"$f":"VLOOKUP($CR54,SurveyDataContacts,'Survey Contacts'!$BD$24,FALSE)","v":{"$error":"#N/A"}},{"$f":"VLOOKUP($CR54,SurveyDataContacts,'Survey Contacts'!$DS$24,FALSE)","v":{"$error":"#N/A"}},{"$f":"VLOOKUP($CR54,SurveyDataContacts,'Survey Contacts'!$BV$24,FALSE)","v":{"$error":"#N/A"}},{"$f":"VLOOKUP($CR54,SurveyDataContacts,'Survey Contacts'!$CQ$24,FALSE)","v":{"$error":"#N/A"}},{"$f":"VLOOKUP($CR54,SurveyDataContacts,'Survey Contacts'!$DE$24,FALSE)","v":{"$error":"#N/A"}},{"$f":"VLOOKUP($CR54,Country_Information_SC,$N$153,FALSE)","v":{"$error":"#N/A"}},{"$f":"IF(DB54<16,\"15 or Less\",\"More than 15\")","v":{"$error":"#N/A"}},{"$f":"VLOOKUP($CR54,Country_Information_SC,$W$153,FALSE)","v":{"$error":"#N/A"}},{"$f":"VLOOKUP($CR54,Country_Information_SC,$AF$153,FALSE)","v":{"$error":"#N/A"}},{"$f":"YEAR($I$42)","v":1900},{"$f":"CR54&\" - \"&DF54","v":"0 - 1900"},null,{"$f":"CV54&CR54&DF54","v":"01900"},{"$f":"VLOOKUP($D54,HQ_Contacts,'HQ and Regional Contacts'!$Q$24,FALSE)","v":{"$error":"#N/A"}},{"$f":"VLOOKUP($D54,HQ_Contacts,'HQ and Regional Contacts'!$Y$24,FALSE)","v":{"$error":"#N/A"}},{"$f":"VLOOKUP($D54,HQ_Contacts,'HQ and Regional Contacts'!$AQ$24,FALSE)","v":{"$error":"#N/A"}},{"$f":"CV54","v":""},{"$f":"VLOOKUP($D54,HQ_Contacts,'HQ and Regional Contacts'!$BI$24,FALSE)","v":{"$error":"#N/A"}},{"$f":"VLOOKUP($D54,HQ_Contacts,'HQ and Regional Contacts'!$DX$24,FALSE)","v":{"$error":"#N/A"}},{"$f":"VLOOKUP($D54,HQ_Contacts,'HQ and Regional Contacts'!$CA$24,FALSE)","v":{"$error":"#N/A"}},{"$f":"VLOOKUP($D54,HQ_Contacts,'HQ and Regional Contacts'!$CV$24,FALSE)","v":{"$error":"#N/A"}},{"$f":"VLOOKUP($D54,HQ_Contacts,'HQ and Regional Contacts'!$DJ$24,FALSE)","v":{"$error":"#N/A"}},null,null,{"$f":"IF(ISBLANK(BillingSurnames),\"Same Individual\",\"Different Individual\")","v":"Same Individual"},{"$f":"$Z$29","v":""},{"$f":"$AB$29","v":""},{"$f":"$AN$29","v":""},{"$f":"$C$29","v":""},{"$f":"$C$32","v":""},{"$f":"$AF$36","v":""},{"$f":"$AB$32","v":""},{"$f":"$O$32","v":""},{"$f":"$AN$32","v":""},{"$f":"EV54","v":""},null,{"$f":"IF(D54=\"\",\"\",IF(M54=\"Yes\",\"Yes\",\"No\"))","v":""},"No",null,null,null,{"$f":"IF(D54=\"\",\"\",\"Sustaining Contributor: \")","v":""},{"$f":"TEXT($I$42,\"dd-mmm-yyyy\")","v":"00-Jan-1900"},{"$f":"TEXT(EM54+364,\"dd-mmm-yyyy\")&\";\"","v":{"$error":"#VALUE!"}},{"$f":"IF('Order Form'!$L$101=\"NGO\",\"\",\" (CDO Pricing); \")","v":" (CDO Pricing); "},{"$f":"IF(AE54=\"X\",\"Indigo Access;\",\"\")","v":""},{"$f":"IF(Z54=\"X\",\"MS Add-on;\",\"\")","v":""},{"$f":"IF(AJ54=\"\",\"\",\"Custom Cut (\"&AJ54&\");\")","v":""},{"$f":"IF(#REF!=\"\",\"\",\"Subsector: \"&#REF!&\";\")","v":{"$error":"#REF!"}},{"$f":"IF(EG54=\"Yes\",\"\",\"No data to provide;\")","v":"No data to provide;"},null,{"$f":"IF(EL54=\"\",\"\",EL54&EM54&\" - \"&EN54&EO54&EP54&EQ54&ER54&ES54&ET54)","v":""}]
[null,null,{"$f":"C54+1","v":2},null,null,null,null,null,null,null,null,null,null,null,null,null,null,"",null,null,null,null,null,null,null,null,null,null,null,{"$f":"IF(AND(Z55=\"x\",R55=\"NGOLP & Multisector\"),1,0)","v":0},null,null,null,null,null,null,null,null,null,null,null,null,null,"",null,null,null,null,null,null,null,null,null,null,null,null,null,null,null,null,null,null,null,0,0,"","","",{"$error":"#N/A"},"",0,null,null,"",{"$error":"#N/A"},"1901-12-31",{"$f":"IF(BX55=\"\",\"\",DATE(YEAR(BX55)+1,MONTH(BX55),DAY(BX55)-1))","v":"1902-12-30"},null,null,null,null,null,null,null,{"$f":"TODAY()","v":"2021-03-18"},{"$f":"$Z$17","v":""},{"$f":"$AB$17","v":""},{"$f":"$AN$17","v":""},{"$f":"$C$17","v":""},{"$f":"$C$20","v":""},{"$f":"$AF$24","v":""},{"$f":"$AB$20","v":""},{"$f":"$O$20","v":""},{"$f":"$AN$20","v":""},0,{"$f":"D55","v":0},{"$f":"VLOOKUP($CR55,SurveyDataContacts,'Survey Contacts'!$L$24,FALSE)","v":{"$error":"#N/A"}},{"$f":"VLOOKUP($CR55,SurveyDataContacts,'Survey Contacts'!$T$24,FALSE)","v":{"$error":"#N/A"}},{"$f":"VLOOKUP($CR55,SurveyDataContacts,'Survey Contacts'!$AL$24,FALSE)","v":{"$error":"#N/A"}},{"$f":"CK55","v":""},{"$f":"VLOOKUP($CR55,SurveyDataContacts,'Survey Contacts'!$BD$24,FALSE)","v":{"$error":"#N/A"}},{"$f":"VLOOKUP($CR55,SurveyDataContacts,'Survey Contacts'!$DS$24,FALSE)","v":{"$error":"#N/A"}},{"$f":"VLOOKUP($CR55,SurveyDataContacts,'Survey Contacts'!$BV$24,FALSE)","v":{"$error":"#N/A"}},{"$f":"VLOOKUP($CR55,SurveyDataContacts,'Survey Contacts'!$CQ$24,FALSE)","v":{"$error":"#N/A"}},{"$f":"VLOOKUP($CR55,SurveyDataContacts,'Survey Contacts'!$DE$24,FALSE)","v":{"$error":"#N/A"}},{"$error":"#N/A"},{"$f":"IF(DB55<16,\"15 or Less\",\"More than 15\")","v":{"$error":"#N/A"}},{"$error":"#N/A"},{"$error":"#N/A"},{"$f":"YEAR($I$42)","v":1900},{"$f":"CR55&\" - \"&DF55","v":"0 - 1900"},null,{"$f":"CV55&CR55&DF55","v":"01900"},{"$f":"VLOOKUP($D55,HQ_Contacts,'HQ and Regional Contacts'!$Q$24,FALSE)","v":{"$error":"#N/A"}},{"$f":"VLOOKUP($D55,HQ_Contacts,'HQ and Regional Contacts'!$Y$24,FALSE)","v":{"$error":"#N/A"}},{"$f":"VLOOKUP($D55,HQ_Contacts,'HQ and Regional Contacts'!$AQ$24,FALSE)","v":{"$error":"#N/A"}},{"$f":"CV55","v":""},{"$f":"VLOOKUP($D55,HQ_Contacts,'HQ and Regional Contacts'!$BI$24,FALSE)","v":{"$error":"#N/A"}},{"$f":"VLOOKUP($D55,HQ_Contacts,'HQ and Regional Contacts'!$DX$24,FALSE)","v":{"$error":"#N/A"}},{"$f":"VLOOKUP($D55,HQ_Contacts,'HQ and Regional Contacts'!$CA$24,FALSE)","v":{"$error":"#N/A"}},{"$f":"VLOOKUP($D55,HQ_Contacts,'HQ and Regional Contacts'!$CV$24,FALSE)","v":{"$error":"#N/A"}},{"$f":"VLOOKUP($D55,HQ_Contacts,'HQ and Regional Contacts'!$DJ$24,FALSE)","v":{"$error":"#N/A"}},null,null,"Same Individual",{"$f":"$Z$29","v":""},{"$f":"$AB$29","v":""},{"$f":"$AN$29","v":""},{"$f":"$C$29","v":""},{"$f":"$C$32","v":""},{"$f":"$AF$36","v":""},{"$f":"$AB$32","v":""},{"$f":"$O$32","v":""},{"$f":"$AN$32","v":""},{"$f":"EV55","v":""},null,{"$f":"IF(D55=\"\",\"\",IF(M55=\"Yes\",\"Yes\",\"No\"))","v":""},"No",null,null,null,{"$f":"IF(D55=\"\",\"\",\"Sustaining Contributor: \")","v":""},{"$f":"TEXT($I$42,\"dd-mmm-yyyy\")","v":"00-Jan-1900"},{"$f":"TEXT(EM55+364,\"dd-mmm-yyyy\")&\";\"","v":{"$error":"#VALUE!"}},{"$f":"IF('Order Form'!$L$101=\"NGO\",\"\",\" (CDO Pricing); \")","v":" (CDO Pricing); "},{"$f":"IF(AE55=\"X\",\"Indigo Access;\",\"\")","v":""},{"$f":"IF(Z55=\"X\",\"MS Add-on;\",\"\")","v":""},{"$f":"IF(AJ55=\"\",\"\",\"Custom Cut (\"&AJ55&\");\")","v":""},{"$f":"IF(#REF!=\"\",\"\",\"Subsector: \"&#REF!&\";\")","v":{"$error":"#REF!"}},{"$f":"IF(EG55=\"Yes\",\"\",\"No data to provide;\")","v":"No data to provide;"},null,{"$f":"IF(EL55=\"\",\"\",EL55&EM55&\" - \"&EN55&EO55&EP55&EQ55&ER55&ES55&ET55)","v":""}]
[null,null,{"$f":"C55+1","v":3},null,null,null,null,null,null,null,null,null,null,null,null,null,null,"",null,null,null,null,null,null,null,null,null,null,null,0,null,null,null,null,null,null,null,null,null,null,null,null,null,"",null,null,null,null,null,null,null,null,null,null,null,null,null,null,null,null,null,null,null,0,0,"","","",{"$error":"#N/A"},"",0,null,null,"",{"$error":"#N/A"},"1901-12-31","1902-12-30",null,null,null,null,null,null,null,"2021-03-18","","","","","","","","","",0,0,{"$f":"VLOOKUP($CR56,SurveyDataContacts,'Survey Contacts'!$L$24,FALSE)","v":{"$error":"#N/A"}},{"$f":"VLOOKUP($CR56,SurveyDataContacts,'Survey Contacts'!$T$24,FALSE)","v":{"$error":"#N/A"}},{"$f":"VLOOKUP($CR56,SurveyDataContacts,'Survey Contacts'!$AL$24,FALSE)","v":{"$error":"#N/A"}},"",{"$f":"VLOOKUP($CR56,SurveyDataContacts,'Survey Contacts'!$BD$24,FALSE)","v":{"$error":"#N/A"}},{"$f":"VLOOKUP($CR56,SurveyDataContacts,'Survey Contacts'!$DS$24,FALSE)","v":{"$error":"#N/A"}},{"$f":"VLOOKUP($CR56,SurveyDataContacts,'Survey Contacts'!$BV$24,FALSE)","v":{"$error":"#N/A"}},{"$f":"VLOOKUP($CR56,SurveyDataContacts,'Survey Contacts'!$CQ$24,FALSE)","v":{"$error":"#N/A"}},{"$f":"VLOOKUP($CR56,SurveyDataContacts,'Survey Contacts'!$DE$24,FALSE)","v":{"$error":"#N/A"}},{"$error":"#N/A"},{"$error":"#N/A"},{"$error":"#N/A"},{"$error":"#N/A"},1900,"0 - 1900",null,"01900",{"$f":"VLOOKUP($D56,HQ_Contacts,'HQ and Regional Contacts'!$Q$24,FALSE)","v":{"$error":"#N/A"}},{"$f":"VLOOKUP($D56,HQ_Contacts,'HQ and Regional Contacts'!$Y$24,FALSE)","v":{"$error":"#N/A"}},{"$f":"VLOOKUP($D56,HQ_Contacts,'HQ and Regional Contacts'!$AQ$24,FALSE)","v":{"$error":"#N/A"}},"",{"$f":"VLOOKUP($D56,HQ_Contacts,'HQ and Regional Contacts'!$BI$24,FALSE)","v":{"$error":"#N/A"}},{"$f":"VLOOKUP($D56,HQ_Contacts,'HQ and Regional Contacts'!$DX$24,FALSE)","v":{"$error":"#N/A"}},{"$f":"VLOOKUP($D56,HQ_Contacts,'HQ and Regional Contacts'!$CA$24,FALSE)","v":{"$error":"#N/A"}},{"$f":"VLOOKUP($D56,HQ_Contacts,'HQ and Regional Contacts'!$CV$24,FALSE)","v":{"$error":"#N/A"}},{"$f":"VLOOKUP($D56,HQ_Contacts,'HQ and Regional Contacts'!$DJ$24,FALSE)","v":{"$error":"#N/A"}},null,null,"Same Individual","","","","","","","","","","",null,"","No",null,null,null,"","00-Jan-1900",{"$error":"#VALUE!"},{"$f":"IF('Order Form'!$L$101=\"NGO\",\"\",\" (CDO Pricing); \")","v":" (CDO Pricing); "},"","",{"$f":"IF(AJ56=\"\",\"\",\"Custom Cut (\"&AJ56&\");\")","v":""},{"$f":"IF(#REF!=\"\",\"\",\"Subsector: \"&#REF!&\";\")","v":{"$error":"#REF!"}},"No data to provide;",null,""]
[null,null,4,null,null,null,null,null,null,null,null,null,null,null,null,null,null,"",null,null,null,null,null,null,null,null,null,null,null,0,null,null,null,null,null,null,null,null,null,null,null,null,null,"",null,null,null,null,null,null,null,null,null,null,null,null,null,null,null,null,null,null,null,0,0,"","","",{"$error":"#N/A"},"",0,null,null,"",{"$error":"#N/A"},"1901-12-31","1902-12-30",null,null,null,null,null,null,null,"2021-03-18","","","","","","","","","",0,{"$f":"D57","v":0},{"$f":"VLOOKUP($CR57,SurveyDataContacts,'Survey Contacts'!$L$24,FALSE)","v":{"$error":"#N/A"}},{"$f":"VLOOKUP($CR57,SurveyDataContacts,'Survey Contacts'!$T$24,FALSE)","v":{"$error":"#N/A"}},{"$f":"VLOOKUP($CR57,SurveyDataContacts,'Survey Contacts'!$AL$24,FALSE)","v":{"$error":"#N/A"}},{"$f":"CK57","v":""},{"$f":"VLOOKUP($CR57,SurveyDataContacts,'Survey Contacts'!$BD$24,FALSE)","v":{"$error":"#N/A"}},{"$f":"VLOOKUP($CR57,SurveyDataContacts,'Survey Contacts'!$DS$24,FALSE)","v":{"$error":"#N/A"}},{"$f":"VLOOKUP($CR57,SurveyDataContacts,'Survey Contacts'!$BV$24,FALSE)","v":{"$error":"#N/A"}},{"$f":"VLOOKUP($CR57,SurveyDataContacts,'Survey Contacts'!$CQ$24,FALSE)","v":{"$error":"#N/A"}},{"$f":"VLOOKUP($CR57,SurveyDataContacts,'Survey Contacts'!$DE$24,FALSE)","v":{"$error":"#N/A"}},{"$error":"#N/A"},{"$f":"IF(DB57<16,\"15 or Less\",\"More than 15\")","v":{"$error":"#N/A"}},{"$error":"#N/A"},{"$error":"#N/A"},1900,{"$f":"CR57&\" - \"&DF57","v":"0 - 1900"},null,{"$f":"CV57&CR57&DF57","v":"01900"},{"$f":"VLOOKUP($D57,HQ_Contacts,'HQ and Regional Contacts'!$Q$24,FALSE)","v":{"$error":"#N/A"}},{"$f":"VLOOKUP($D57,HQ_Contacts,'HQ and Regional Contacts'!$Y$24,FALSE)","v":{"$error":"#N/A"}},{"$f":"VLOOKUP($D57,HQ_Contacts,'HQ and Regional Contacts'!$AQ$24,FALSE)","v":{"$error":"#N/A"}},{"$f":"CV57","v":""},{"$f":"VLOOKUP($D57,HQ_Contacts,'HQ and Regional Contacts'!$BI$24,FALSE)","v":{"$error":"#N/A"}},{"$f":"VLOOKUP($D57,HQ_Contacts,'HQ and Regional Contacts'!$DX$24,FALSE)","v":{"$error":"#N/A"}},{"$f":"VLOOKUP($D57,HQ_Contacts,'HQ and Regional Contacts'!$CA$24,FALSE)","v":{"$error":"#N/A"}},{"$f":"VLOOKUP($D57,HQ_Contacts,'HQ and Regional Contacts'!$CV$24,FALSE)","v":{"$error":"#N/A"}},{"$f":"VLOOKUP($D57,HQ_Contacts,'HQ and Regional Contacts'!$DJ$24,FALSE)","v":{"$error":"#N/A"}},null,null,"Same Individual","","","","","","","","","",{"$f":"EV57","v":""},null,{"$f":"IF(D57=\"\",\"\",IF(M57=\"Yes\",\"Yes\",\"No\"))","v":""},"No",null,null,null,{"$f":"IF(D57=\"\",\"\",\"Sustaining Contributor: \")","v":""},"00-Jan-1900",{"$error":"#VALUE!"},{"$f":"IF('Order Form'!$L$101=\"NGO\",\"\",\" (CDO Pricing); \")","v":" (CDO Pricing); "},{"$f":"IF(AE57=\"X\",\"Indigo Access;\",\"\")","v":""},{"$f":"IF(Z57=\"X\",\"MS Add-on;\",\"\")","v":""},{"$f":"IF(AJ57=\"\",\"\",\"Custom Cut (\"&AJ57&\");\")","v":""},{"$f":"IF(#REF!=\"\",\"\",\"Subsector: \"&#REF!&\";\")","v":{"$error":"#REF!"}},{"$f":"IF(EG57=\"Yes\",\"\",\"No data to provide;\")","v":"No data to provide;"},null,""]
[null,null,5,null,null,null,null,null,null,null,null,null,null,null,null,null,null,"",null,null,null,null,null,null,null,null,null,null,null,0,null,null,null,null,null,null,null,null,null,null,null,null,null,"",null,null,null,null,null,null,null,null,null,null,null,null,null,null,null,null,null,null,null,0,0,"","","",{"$error":"#N/A"},"",0,null,null,"",{"$error":"#N/A"},"1901-12-31","1902-12-30",null,null,null,null,null,null,null,"2021-03-18","","","","","","","","","",0,0,{"$f":"VLOOKUP($CR58,SurveyDataContacts,'Survey Contacts'!$L$24,FALSE)","v":{"$error":"#N/A"}},{"$f":"VLOOKUP($CR58,SurveyDataContacts,'Survey Contacts'!$T$24,FALSE)","v":{"$error":"#N/A"}},{"$f":"VLOOKUP($CR58,SurveyDataContacts,'Survey Contacts'!$AL$24,FALSE)","v":{"$error":"#N/A"}},"",{"$f":"VLOOKUP($CR58,SurveyDataContacts,'Survey Contacts'!$BD$24,FALSE)","v":{"$error":"#N/A"}},{"$f":"VLOOKUP($CR58,SurveyDataContacts,'Survey Contacts'!$DS$24,FALSE)","v":{"$error":"#N/A"}},{"$f":"VLOOKUP($CR58,SurveyDataContacts,'Survey Contacts'!$BV$24,FALSE)","v":{"$error":"#N/A"}},{"$f":"VLOOKUP($CR58,SurveyDataContacts,'Survey Contacts'!$CQ$24,FALSE)","v":{"$error":"#N/A"}},{"$f":"VLOOKUP($CR58,SurveyDataContacts,'Survey Contacts'!$DE$24,FALSE)","v":{"$error":"#N/A"}},{"$error":"#N/A"},{"$error":"#N/A"},{"$error":"#N/A"},{"$error":"#N/A"},1900,"0 - 1900",null,"01900",{"$f":"VLOOKUP($D58,HQ_Contacts,'HQ and Regional Contacts'!$Q$24,FALSE)","v":{"$error":"#N/A"}},{"$f":"VLOOKUP($D58,HQ_Contacts,'HQ and Regional Contacts'!$Y$24,FALSE)","v":{"$error":"#N/A"}},{"$f":"VLOOKUP($D58,HQ_Contacts,'HQ and Regional Contacts'!$AQ$24,FALSE)","v":{"$error":"#N/A"}},"",{"$f":"VLOOKUP($D58,HQ_Contacts,'HQ and Regional Contacts'!$BI$24,FALSE)","v":{"$error":"#N/A"}},{"$f":"VLOOKUP($D58,HQ_Contacts,'HQ and Regional Contacts'!$DX$24,FALSE)","v":{"$error":"#N/A"}},{"$f":"VLOOKUP($D58,HQ_Contacts,'HQ and Regional Contacts'!$CA$24,FALSE)","v":{"$error":"#N/A"}},{"$f":"VLOOKUP($D58,HQ_Contacts,'HQ and Regional Contacts'!$CV$24,FALSE)","v":{"$error":"#N/A"}},{"$f":"VLOOKUP($D58,HQ_Contacts,'HQ and Regional Contacts'!$DJ$24,FALSE)","v":{"$error":"#N/A"}},null,null,"Same Individual","","","","","","","","","","",null,"","No",null,null,null,"","00-Jan-1900",{"$error":"#VALUE!"},{"$f":"IF('Order Form'!$L$101=\"NGO\",\"\",\" (CDO Pricing); \")","v":" (CDO Pricing); "},"","",{"$f":"IF(AJ58=\"\",\"\",\"Custom Cut (\"&AJ58&\");\")","v":""},{"$f":"IF(#REF!=\"\",\"\",\"Subsector: \"&#REF!&\";\")","v":{"$error":"#REF!"}},"No data to provide;",null,""]
[null,null,6,null,null,null,null,null,null,null,null,null,null,null,null,null,null,"",null,null,null,null,null,null,null,null,null,null,null,0,null,null,null,null,null,null,null,null,null,null,null,null,null,"",null,null,null,null,null,null,null,null,null,null,null,null,null,null,null,null,null,null,null,0,0,"","","",{"$error":"#N/A"},"",0,null,null,"",{"$error":"#N/A"},"1901-12-31","1902-12-30",null,null,null,null,null,null,null,"2021-03-18","","","","","","","","","",0,{"$f":"D59","v":0},{"$f":"VLOOKUP($CR59,SurveyDataContacts,'Survey Contacts'!$L$24,FALSE)","v":{"$error":"#N/A"}},{"$f":"VLOOKUP($CR59,SurveyDataContacts,'Survey Contacts'!$T$24,FALSE)","v":{"$error":"#N/A"}},{"$f":"VLOOKUP($CR59,SurveyDataContacts,'Survey Contacts'!$AL$24,FALSE)","v":{"$error":"#N/A"}},{"$f":"CK59","v":""},{"$f":"VLOOKUP($CR59,SurveyDataContacts,'Survey Contacts'!$BD$24,FALSE)","v":{"$error":"#N/A"}},{"$f":"VLOOKUP($CR59,SurveyDataContacts,'Survey Contacts'!$DS$24,FALSE)","v":{"$error":"#N/A"}},{"$f":"VLOOKUP($CR59,SurveyDataContacts,'Survey Contacts'!$BV$24,FALSE)","v":{"$error":"#N/A"}},{"$f":"VLOOKUP($CR59,SurveyDataContacts,'Survey Contacts'!$CQ$24,FALSE)","v":{"$error":"#N/A"}},{"$f":"VLOOKUP($CR59,SurveyDataContacts,'Survey Contacts'!$DE$24,FALSE)","v":{"$error":"#N/A"}},{"$error":"#N/A"},{"$f":"IF(DB59<16,\"15 or Less\",\"More than 15\")","v":{"$error":"#N/A"}},{"$error":"#N/A"},{"$error":"#N/A"},1900,{"$f":"CR59&\" - \"&DF59","v":"0 - 1900"},null,{"$f":"CV59&CR59&DF59","v":"01900"},{"$f":"VLOOKUP($D59,HQ_Contacts,'HQ and Regional Contacts'!$Q$24,FALSE)","v":{"$error":"#N/A"}},{"$f":"VLOOKUP($D59,HQ_Contacts,'HQ and Regional Contacts'!$Y$24,FALSE)","v":{"$error":"#N/A"}},{"$f":"VLOOKUP($D59,HQ_Contacts,'HQ and Regional Contacts'!$AQ$24,FALSE)","v":{"$error":"#N/A"}},{"$f":"CV59","v":""},{"$f":"VLOOKUP($D59,HQ_Contacts,'HQ and Regional Contacts'!$BI$24,FALSE)","v":{"$error":"#N/A"}},{"$f":"VLOOKUP($D59,HQ_Contacts,'HQ and Regional Contacts'!$DX$24,FALSE)","v":{"$error":"#N/A"}},{"$f":"VLOOKUP($D59,HQ_Contacts,'HQ and Regional Contacts'!$CA$24,FALSE)","v":{"$error":"#N/A"}},{"$f":"VLOOKUP($D59,HQ_Contacts,'HQ and Regional Contacts'!$CV$24,FALSE)","v":{"$error":"#N/A"}},{"$f":"VLOOKUP($D59,HQ_Contacts,'HQ and Regional Contacts'!$DJ$24,FALSE)","v":{"$error":"#N/A"}},null,null,"Same Individual","","","","","","","","","",{"$f":"EV59","v":0},null,{"$f":"IF(D59=\"\",\"\",IF(M59=\"Yes\",\"Yes\",\"No\"))","v":""},"No"]
[null,null,7,null,null,null,null,null,null,null,null,null,null,null,null,null,null,"",null,null,null,null,null,null,null,null,null,null,null,0,null,null,null,null,null,null,null,null,null,null,null,null,null,"",null,null,null,null,null,null,null,null,null,null,null,null,null,null,null,null,null,null,null,0,0,"","","",{"$error":"#N/A"},"",0,null,null,"",{"$error":"#N/A"},"1901-12-31","1902-12-30",null,null,null,null,null,null,null,"2021-03-18","","","","","","","","","",0,0,{"$f":"VLOOKUP($CR60,SurveyDataContacts,'Survey Contacts'!$L$24,FALSE)","v":{"$error":"#N/A"}},{"$f":"VLOOKUP($CR60,SurveyDataContacts,'Survey Contacts'!$T$24,FALSE)","v":{"$error":"#N/A"}},{"$f":"VLOOKUP($CR60,SurveyDataContacts,'Survey Contacts'!$AL$24,FALSE)","v":{"$error":"#N/A"}},"",{"$f":"VLOOKUP($CR60,SurveyDataContacts,'Survey Contacts'!$BD$24,FALSE)","v":{"$error":"#N/A"}},{"$f":"VLOOKUP($CR60,SurveyDataContacts,'Survey Contacts'!$DS$24,FALSE)","v":{"$error":"#N/A"}},{"$f":"VLOOKUP($CR60,SurveyDataContacts,'Survey Contacts'!$BV$24,FALSE)","v":{"$error":"#N/A"}},{"$f":"VLOOKUP($CR60,SurveyDataContacts,'Survey Contacts'!$CQ$24,FALSE)","v":{"$error":"#N/A"}},{"$f":"VLOOKUP($CR60,SurveyDataContacts,'Survey Contacts'!$DE$24,FALSE)","v":{"$error":"#N/A"}},{"$error":"#N/A"},{"$error":"#N/A"},{"$error":"#N/A"},{"$error":"#N/A"},1900,"0 - 1900",null,"01900",{"$f":"VLOOKUP($D60,HQ_Contacts,'HQ and Regional Contacts'!$Q$24,FALSE)","v":{"$error":"#N/A"}},{"$f":"VLOOKUP($D60,HQ_Contacts,'HQ and Regional Contacts'!$Y$24,FALSE)","v":{"$error":"#N/A"}},{"$f":"VLOOKUP($D60,HQ_Contacts,'HQ and Regional Contacts'!$AQ$24,FALSE)","v":{"$error":"#N/A"}},"",{"$f":"VLOOKUP($D60,HQ_Contacts,'HQ and Regional Contacts'!$BI$24,FALSE)","v":{"$error":"#N/A"}},{"$f":"VLOOKUP($D60,HQ_Contacts,'HQ and Regional Contacts'!$DX$24,FALSE)","v":{"$error":"#N/A"}},{"$f":"VLOOKUP($D60,HQ_Contacts,'HQ and Regional Contacts'!$CA$24,FALSE)","v":{"$error":"#N/A"}},{"$f":"VLOOKUP($D60,HQ_Contacts,'HQ and Regional Contacts'!$CV$24,FALSE)","v":{"$error":"#N/A"}},{"$f":"VLOOKUP($D60,HQ_Contacts,'HQ and Regional Contacts'!$DJ$24,FALSE)","v":{"$error":"#N/A"}},null,null,"Same Individual","","","","","","","","","",0,null,"","No"]
[null,null,8,null,null,null,null,null,null,null,null,null,null,null,null,null,null,"",null,null,null,null,null,null,null,null,null,null,null,0,null,null,null,null,null,null,null,null,null,null,null,null,null,"",null,null,null,null,null,null,null,null,null,null,null,null,null,null,null,null,null,null,null,0,0,"","","",{"$error":"#N/A"},"",0,null,null,"",{"$error":"#N/A"},"1901-12-31","1902-12-30",null,null,null,null,null,null,null,"2021-03-18","","","","","","","","","",0,0,{"$f":"VLOOKUP($CR61,SurveyDataContacts,'Survey Contacts'!$L$24,FALSE)","v":{"$error":"#N/A"}},{"$f":"VLOOKUP($CR61,SurveyDataContacts,'Survey Contacts'!$T$24,FALSE)","v":{"$error":"#N/A"}},{"$f":"VLOOKUP($CR61,SurveyDataContacts,'Survey Contacts'!$AL$24,FALSE)","v":{"$error":"#N/A"}},"",{"$f":"VLOOKUP($CR61,SurveyDataContacts,'Survey Contacts'!$BD$24,FALSE)","v":{"$error":"#N/A"}},{"$f":"VLOOKUP($CR61,SurveyDataContacts,'Survey Contacts'!$DS$24,FALSE)","v":{"$error":"#N/A"}},{"$f":"VLOOKUP($CR61,SurveyDataContacts,'Survey Contacts'!$BV$24,FALSE)","v":{"$error":"#N/A"}},{"$f":"VLOOKUP($CR61,SurveyDataContacts,'Survey Contacts'!$CQ$24,FALSE)","v":{"$error":"#N/A"}},{"$f":"VLOOKUP($CR61,SurveyDataContacts,'Survey Contacts'!$DE$24,FALSE)","v":{"$error":"#N/A"}},{"$error":"#N/A"},{"$error":"#N/A"},{"$error":"#N/A"},{"$error":"#N/A"},1900,"0 - 1900",null,"01900",{"$f":"VLOOKUP($D61,HQ_Contacts,'HQ and Regional Contacts'!$Q$24,FALSE)","v":{"$error":"#N/A"}},{"$f":"VLOOKUP($D61,HQ_Contacts,'HQ and Regional Contacts'!$Y$24,FALSE)","v":{"$error":"#N/A"}},{"$f":"VLOOKUP($D61,HQ_Contacts,'HQ and Regional Contacts'!$AQ$24,FALSE)","v":{"$error":"#N/A"}},"",{"$f":"VLOOKUP($D61,HQ_Contacts,'HQ and Regional Contacts'!$BI$24,FALSE)","v":{"$error":"#N/A"}},{"$f":"VLOOKUP($D61,HQ_Contacts,'HQ and Regional Contacts'!$DX$24,FALSE)","v":{"$error":"#N/A"}},{"$f":"VLOOKUP($D61,HQ_Contacts,'HQ and Regional Contacts'!$CA$24,FALSE)","v":{"$error":"#N/A"}},{"$f":"VLOOKUP($D61,HQ_Contacts,'HQ and Regional Contacts'!$CV$24,FALSE)","v":{"$error":"#N/A"}},{"$f":"VLOOKUP($D61,HQ_Contacts,'HQ and Regional Contacts'!$DJ$24,FALSE)","v":{"$error":"#N/A"}},null,null,"Same Individual","","","","","","","","","",0,null,"","No"]
[null,null,9,null,null,null,null,null,null,null,null,null,null,null,null,null,null,"",null,null,null,null,null,null,null,null,null,null,null,0,null,null,null,null,null,null,null,null,null,null,null,null,null,"",null,null,null,null,null,null,null,null,null,null,null,null,null,null,null,null,null,null,null,0,0,"","","",{"$error":"#N/A"},"",0,null,null,"",{"$error":"#N/A"},"1901-12-31","1902-12-30",null,null,null,null,null,null,null,"2021-03-18","","","","","","","","","",0,0,{"$f":"VLOOKUP($CR62,SurveyDataContacts,'Survey Contacts'!$L$24,FALSE)","v":{"$error":"#N/A"}},{"$f":"VLOOKUP($CR62,SurveyDataContacts,'Survey Contacts'!$T$24,FALSE)","v":{"$error":"#N/A"}},{"$f":"VLOOKUP($CR62,SurveyDataContacts,'Survey Contacts'!$AL$24,FALSE)","v":{"$error":"#N/A"}},"",{"$f":"VLOOKUP($CR62,SurveyDataContacts,'Survey Contacts'!$BD$24,FALSE)","v":{"$error":"#N/A"}},{"$f":"VLOOKUP($CR62,SurveyDataContacts,'Survey Contacts'!$DS$24,FALSE)","v":{"$error":"#N/A"}},{"$f":"VLOOKUP($CR62,SurveyDataContacts,'Survey Contacts'!$BV$24,FALSE)","v":{"$error":"#N/A"}},{"$f":"VLOOKUP($CR62,SurveyDataContacts,'Survey Contacts'!$CQ$24,FALSE)","v":{"$error":"#N/A"}},{"$f":"VLOOKUP($CR62,SurveyDataContacts,'Survey Contacts'!$DE$24,FALSE)","v":{"$error":"#N/A"}},{"$error":"#N/A"},{"$error":"#N/A"},{"$error":"#N/A"},{"$error":"#N/A"},1900,"0 - 1900",null,"01900",{"$f":"VLOOKUP($D62,HQ_Contacts,'HQ and Regional Contacts'!$Q$24,FALSE)","v":{"$error":"#N/A"}},{"$f":"VLOOKUP($D62,HQ_Contacts,'HQ and Regional Contacts'!$Y$24,FALSE)","v":{"$error":"#N/A"}},{"$f":"VLOOKUP($D62,HQ_Contacts,'HQ and Regional Contacts'!$AQ$24,FALSE)","v":{"$error":"#N/A"}},"",{"$f":"VLOOKUP($D62,HQ_Contacts,'HQ and Regional Contacts'!$BI$24,FALSE)","v":{"$error":"#N/A"}},{"$f":"VLOOKUP($D62,HQ_Contacts,'HQ and Regional Contacts'!$DX$24,FALSE)","v":{"$error":"#N/A"}},{"$f":"VLOOKUP($D62,HQ_Contacts,'HQ and Regional Contacts'!$CA$24,FALSE)","v":{"$error":"#N/A"}},{"$f":"VLOOKUP($D62,HQ_Contacts,'HQ and Regional Contacts'!$CV$24,FALSE)","v":{"$error":"#N/A"}},{"$f":"VLOOKUP($D62,HQ_Contacts,'HQ and Regional Contacts'!$DJ$24,FALSE)","v":{"$error":"#N/A"}},null,null,"Same Individual","","","","","","","","","",0,null,"","No"]
[null,null,10,null,"NGO Global Pay",null,null,null,null,null,null,null,{"$f":"IF(NGOGPChoice=\"No\",\"\",IF(NGOGPChoice=\"Yes (Participant)\", \"Yes\",\"No\"))","v":""},null,null,null,null,{"$f":"IF(NGOGPChoice=\"Yes (Participant)\", \"NGO Global Pay\",IF(NGOGPChoice=\"Yes (Non-Participant)\",\"NGO Global Pay\",\"\"))","v":""},null,null,null,null,null,null,null,null,null,null,null,null,null,null,null,null,null,null,null,null,null,null,null,null,null,{"$f":"IF(ISBLANK(M63),0,IF(M63=\"Yes\",0,NGOGlobalPayFee*0.5))","v":0},null,null,null,null,null,null,null,null,null,null,null,null,null,null,null,null,null,null,null,null,null,null,null,null,null,null,null,null,null,null,null,null,null,null,null,null,null,null,null,null,"2021-03-18","","","","","","","","","",0,0,{"$f":"VLOOKUP($CR63,SurveyDataContacts,'Survey Contacts'!$L$24,FALSE)","v":{"$error":"#N/A"}},{"$f":"VLOOKUP($CR63,SurveyDataContacts,'Survey Contacts'!$T$24,FALSE)","v":{"$error":"#N/A"}},{"$f":"VLOOKUP($CR63,SurveyDataContacts,'Survey Contacts'!$AL$24,FALSE)","v":{"$error":"#N/A"}},"",{"$f":"VLOOKUP($CR63,SurveyDataContacts,'Survey Contacts'!$BD$24,FALSE)","v":{"$error":"#N/A"}},{"$f":"VLOOKUP($CR63,SurveyDataContacts,'Survey Contacts'!$DS$24,FALSE)","v":{"$error":"#N/A"}},{"$f":"VLOOKUP($CR63,SurveyDataContacts,'Survey Contacts'!$BV$24,FALSE)","v":{"$error":"#N/A"}},{"$f":"VLOOKUP($CR63,SurveyDataContacts,'Survey Contacts'!$CQ$24,FALSE)","v":{"$error":"#N/A"}},{"$f":"VLOOKUP($CR63,SurveyDataContacts,'Survey Contacts'!$DE$24,FALSE)","v":{"$error":"#N/A"}},{"$error":"#N/A"},{"$error":"#N/A"},{"$error":"#N/A"},{"$error":"#N/A"},1900,"0 - 1900",null,"01900",{"$f":"VLOOKUP($D63,HQ_Contacts,'HQ and Regional Contacts'!$Q$24,FALSE)","v":{"$error":"#N/A"}},{"$f":"VLOOKUP($D63,HQ_Contacts,'HQ and Regional Contacts'!$Y$24,FALSE)","v":{"$error":"#N/A"}},{"$f":"VLOOKUP($D63,HQ_Contacts,'HQ and Regional Contacts'!$AQ$24,FALSE)","v":{"$error":"#N/A"}},"",{"$f":"VLOOKUP($D63,HQ_Contacts,'HQ and Regional Contacts'!$BI$24,FALSE)","v":{"$error":"#N/A"}},{"$f":"VLOOKUP($D63,HQ_Contacts,'HQ and Regional Contacts'!$DX$24,FALSE)","v":{"$error":"#N/A"}},{"$f":"VLOOKUP($D63,HQ_Contacts,'HQ and Regional Contacts'!$CA$24,FALSE)","v":{"$error":"#N/A"}},{"$f":"VLOOKUP($D63,HQ_Contacts,'HQ and Regional Contacts'!$CV$24,FALSE)","v":{"$error":"#N/A"}},{"$f":"VLOOKUP($D63,HQ_Contacts,'HQ and Regional Contacts'!$DJ$24,FALSE)","v":{"$error":"#N/A"}},null,null,"Same Individual","","","","","","","","","",0,null,"","No"]
[null,null,11,null,null,null,null,null,null,null,null,null,null,null,null,null,null,"",null,null,null,null,null,null,null,null,null,null,null,null,null,null,null,null,null,null,null,null,null,null,null,null,null,null,null,null,null,null,null,null,null,null,{"$f":"IF(ISBLANK(D64),\"\",IF(M64=\"Yes\",0,NGOSP*0.5))","v":""}]
[null,null,12,null,null,null,null,null,null,null,null,null,null,null,null,null,null,"",null,null,null,null,null,null,null,null,null,null,null,null,null,null,null,null,null,null,null,null,null,null,null,null,null,null,null,null,null,null,null,null,null,null,""]
[null,null,13,null,null,null,null,null,null,null,null,null,null,null,null,null,null,"",null,null,null,null,null,null,null,null,null,null,null,null,null,null,null,null,null,null,null,null,null,null,null,null,null,null,null,null,null,null,null,null,null,null,""]
[null,null,14,null,null,null,null,null,null,null,null,null,null,null,null,null,null,"",null,null,null,null,null,null,null,null,null,null,null,null,null,null,null,null,null,null,null,null,null,null,null,null,null,null,null,null,null,null,null,null,null,null,""]
[null,null,15,null,null,null,null,null,null,null,null,null,null,null,null,null,null,"",null,null,null,null,null,null,null,null,null,null,null,null,null,null,null,null,null,null,null,null,null,null,null,null,null,null,null,null,null,null,null,null,null,null,""]
[null,null,16,null,null,null,null,null,null,null,null,null,null,null,null,null,null,"",null,null,null,null,null,null,null,null,null,null,null,null,null,null,null,null,null,null,null,null,null,null,null,null,null,null,null,null,null,null,null,null,null,null,""]
[null,null,17,null,null,null,null,null,null,null,null,null,null,null,null,null,null,"",null,null,null,null,null,null,null,null,null,null,null,null,null,null,null,null,null,null,null,null,null,null,null,null,null,null,null,null,null,null,null,null,null,null,""]
[null,null,18,null,null,null,null,null,null,null,null,null,null,null,null,null,null,"",null,null,null,null,null,null,null,null,null,null,null,null,null,null,null,null,null,null,null,null,null,null,null,null,null,null,null,null,null,null,null,null,null,null,""]
[null,null,19,null,null,null,null,null,null,null,null,null,null,null,null,null,null,"",null,null,null,null,null,null,null,null,null,null,null,null,null,null,null,null,null,null,null,null,null,null,null,null,null,null,null,null,null,null,null,null,null,null,""]
[null,null,20,null,null,null,null,null,null,null,null,null,null,null,null,null,null,"",null,null,null,null,null,null,null,null,null,null,null,null,null,null,null,null,null,null,null,null,null,null,null,null,null,null,null,null,null,null,null,null,null,null,""]
[null,null,21,null,null,null,null,null,null,null,null,null,null,null,null,null,null,"",null,null,null,null,null,null,null,null,null,null,null,null,null,null,null,null,null,null,null,null,null,null,null,null,null,null,null,null,null,null,null,null,null,null,""]
[null,null,22,null,null,null,null,null,null,null,null,null,null,null,null,null,null,"",null,null,null,null,null,null,null,null,null,null,null,null,null,null,null,null,null,null,null,null,null,null,null,null,null,null,null,null,null,null,null,null,null,null,""]
[null,null,23,null,null,null,null,null,null,null,null,null,null,null,null,null,null,"",null,null,null,null,null,null,null,null,null,null,null,null,null,null,null,null,null,null,null,null,null,null,null,null,null,null,null,null,null,null,null,null,null,null,""]
[null,null,24,null,null,null,null,null,null,null,null,null,null,null,null,null,null,"",null,null,null,null,null,null,null,null,null,null,null,null,null,null,null,null,null,null,null,null,null,null,null,null,null,null,null,null,null,null,null,null,null,null,""]
[null,null,25,null,null,null,null,null,null,null,null,null,null,null,null,null,null,"",null,null,null,null,null,null,null,null,null,null,null,null,null,null,null,null,null,null,null,null,null,null,null,null,null,null,null,null,null,null,null,null,null,null,""]
[null,null,26,null,null,null,null,null,null,null,null,null,null,null,null,null,null,"",null,null,null,null,null,null,null,null,null,null,null,null,null,null,null,null,null,null,null,null,null,null,null,null,null,null,null,null,null,null,null,null,null,null,""]
[null,null,27,null,null,null,null,null,null,null,null,null,null,null,null,null,null,"",null,null,null,null,null,null,null,null,null,null,null,null,null,null,null,null,null,null,null,null,null,null,null,null,null,null,null,null,null,null,null,null,null,null,""]
[null,null,28,null,null,null,null,null,null,null,null,null,null,null,null,null,null,"",null,null,null,null,null,null,null,null,null,null,null,null,null,null,null,null,null,null,null,null,null,null,null,null,null,null,null,null,null,null,null,null,null,null,""]
[null,null,29,null,null,null,null,null,null,null,null,null,null,null,null,null,null,"",null,null,null,null,null,null,null,null,null,null,null,null,null,null,null,null,null,null,null,null,null,null,null,null,null,null,null,null,null,null,null,null,null,null,""]
[null,null,30,null,null,null,null,null,null,null,null,null,null,null,null,null,null,"",null,null,null,null,null,null,null,null,null,null,null,null,null,null,null,null,null,null,null,null,null,null,null,null,null,null,null,null,null,null,null,null,null,null,""]
[null,null,31,null,null,null,null,null,null,null,null,null,null,null,null,null,null,"",null,null,null,null,null,null,null,null,null,null,null,null,null,null,null,null,null,null,null,null,null,null,null,null,null,null,null,null,null,null,null,null,null,null,""]
[null,null,32,null,null,null,null,null,null,null,null,null,null,null,null,null,null,"",null,null,null,null,null,null,null,null,null,null,null,null,null,null,null,null,null,null,null,null,null,null,null,null,null,null,null,null,null,null,null,null,null,null,""]
[null,null,33,null,null,null,null,null,null,null,null,null,null,null,null,null,null,"",null,null,null,null,null,null,null,null,null,null,null,null,null,null,null,null,null,null,null,null,null,null,null,null,null,null,null,null,null,null,null,null,null,null,""]
[null,null,34,null,null,null,null,null,null,null,null,null,null,null,null,null,null,"",null,null,null,null,null,null,null,null,null,null,null,null,null,null,null,null,null,null,null,null,null,null,null,null,null,null,null,null,null,null,null,null,null,null,""]
[null,null,35,null,null,null,null,null,null,null,null,null,null,null,null,null,null,"",null,null,null,null,null,null,null,null,null,null,null,null,null,null,null,null,null,null,null,null,null,null,null,null,null,null,null,null,null,null,null,null,null,null,""]
[null,null,36,null,null,null,null,null,null,null,null,null,null,null,null,null,null,"",null,null,null,null,null,null,null,null,null,null,null,null,null,null,null,null,null,null,null,null,null,null,null,null,null,null,null,null,null,null,null,null,null,null,""]
[null,null,37,null,null,null,null,null,null,null,null,null,null,null,null,null,null,"",null,null,null,null,null,null,null,null,null,null,null,null,null,null,null,null,null,null,null,null,null,null,null,null,null,null,null,null,null,null,null,null,null,null,""]
[null,null,38,null,null,null,null,null,null,null,null,null,null,null,null,null,null,"",null,null,null,null,null,null,null,null,null,null,null,null,null,null,null,null,null,null,null,null,null,null,null,null,null,null,null,null,null,null,null,null,null,null,""]
[null,null,39,null,null,null,null,null,null,null,null,null,null,null,null,null,null,"",null,null,null,null,null,null,null,null,null,null,null,null,null,null,null,null,null,null,null,null,null,null,null,null,null,null,null,null,null,null,null,null,null,null,""]
[null,null,40,null,null,null,null,null,null,null,null,null,null,null,null,null,null,"",null,null,null,null,null,null,null,null,null,null,null,null,null,null,null,null,null,null,null,null,null,null,null,null,null,null,null,null,null,null,null,null,null,null,""]
[null,null,41,null,null,null,null,null,null,null,null,null,null,null,null,null,null,"",null,null,null,null,null,null,null,null,null,null,null,null,null,null,null,null,null,null,null,null,null,null,null,null,null,null,null,null,null,null,null,null,null,null,""]
[null,null,42,null,null,null,null,null,null,null,null,null,null,null,null,null,null,"",null,null,null,null,null,null,null,null,null,null,null,null,null,null,null,null,null,null,null,null,null,null,null,null,null,null,null,null,null,null,null,null,null,null,{"$f":"IF(ISBLANK(D95),\"\",IF(M95=\"Yes\",0,NGOSP*0.5))","v":""}]
[null,null,43,null,null,null,null,null,null,null,null,null,null,null,null,null,null,"",null,null,null,null,null,null,null,null,null,null,null,null,null,null,null,null,null,null,null,null,null,null,null,null,null,null,null,null,null,null,null,null,null,null,""]
[null,null,44,null,null,null,null,null,null,null,null,null,null,null,null,null,null,"",null,null,null,null,null,null,null,null,null,null,null,null,null,null,null,null,null,null,null,null,null,null,null,null,null,null,null,null,null,null,null,null,null,null,""]
[null,null,45,null,null,null,null,null,null,null,null,null,null,null,null,null,null,"",null,null,null,null,null,null,null,null,null,null,null,null,null,null,null,null,null,null,null,null,null,null,null,null,null,null,null,null,null,null,null,null,null,null,""]
[null,null,46,null,null,null,null,null,null,null,null,null,null,null,null,null,null,"",null,null,null,null,null,null,null,null,null,null,null,null,null,null,null,null,null,null,null,null,null,null,null,null,null,null,null,null,null,null,null,null,null,null,""]
[null,null,47,null,null,null,null,null,null,null,null,null,null,null,null,null,null,"",null,null,null,null,null,null,null,null,null,null,null,null,null,null,null,null,null,null,null,null,null,null,null,null,null,null,null,null,null,null,null,null,null,null,""]
[null,null,48,null,null,null,null,null,null,null,null,null,null,null,null,null,null,"",null,null,null,null,null,null,null,null,null,null,null,null,null,null,null,null,null,null,null,null,null,null,null,null,null,null,null,null,null,null,null,null,null,null,""]
[null,null,49,null,null,null,null,null,null,null,null,null,null,null,null,null,null,"",null,null,null,null,null,null,null,null,null,null,null,null,null,null,null,null,null,null,null,null,null,null,null,null,null,null,null,null,null,null,null,null,null,null,""]
[null,null,50,null,null,null,null,null,null,null,null,null,null,null,null,null,null,"",null,null,null,null,null,null,null,null,null,null,null,null,null,null,null,null,null,null,null,null,null,null,null,null,null,null,null,null,null,null,null,null,null,null,""]
[null,null,51,null,null,null,null,null,null,null,null,null,null,null,null,null,null,"",null,null,null,null,null,null,null,null,null,null,null,null,null,null,null,null,null,null,null,null,null,null,null,null,null,null,null,null,null,null,null,null,null,null,""]
[null,null,52,null,null,null,null,null,null,null,null,null,null,null,null,null,null,"",null,null,null,null,null,null,null,null,null,null,null,null,null,null,null,null,null,null,null,null,null,null,null,null,null,null,null,null,null,null,null,null,null,null,""]
[null,null,53,null,null,null,null,null,null,null,null,null,null,null,null,null,null,"",null,null,null,null,null,null,null,null,null,null,null,null,null,null,null,null,null,null,null,null,null,null,null,null,null,null,null,null,null,null,null,null,null,null,""]
[null,null,54,null,null,null,null,null,null,null,null,null,null,null,null,null,null,"",null,null,null,null,null,null,null,null,null,null,null,null,null,null,null,null,null,null,null,null,null,null,null,null,null,null,null,null,null,null,null,null,null,null,""]
[null,null,55,null,null,null,null,null,null,null,null,null,null,null,null,null,null,"",null,null,null,null,null,null,null,null,null,null,null,null,null,null,null,null,null,null,null,null,null,null,null,null,null,null,null,null,null,null,null,null,null,null,""]
[null,null,56,null,null,null,null,null,null,null,null,null,null,null,null,null,null,"",null,null,null,null,null,null,null,null,null,null,null,null,null,null,null,null,null,null,null,null,null,null,null,null,null,null,null,null,null,null,null,null,null,null,""]
[null,null,57,null,null,null,null,null,null,null,null,null,null,null,null,null,null,"",null,null,null,null,null,null,null,null,null,null,null,null,null,null,null,null,null,null,null,null,null,null,null,null,null,null,null,null,null,null,null,null,null,null,""]
[null,null,58,null,null,null,null,null,null,null,null,null,null,null,null,null,null,"",null,null,null,null,null,null,null,null,null,null,null,null,null,null,null,null,null,null,null,null,null,null,null,null,null,null,null,null,null,null,null,null,null,null,""]
[null,null,59,null,null,null,null,null,null,null,null,null,null,null,null,null,null,"",null,null,null,null,null,null,null,null,null,null,null,null,null,null,null,null,null,null,null,null,null,null,null,null,null,null,null,null,null,null,null,null,null,null,""]
[null,null,60,null,null,null,null,null,null,null,null,null,null,null,null,null,null,"",null,null,null,null,null,null,null,null,null,null,null,null,null,null,null,null,null,null,null,null,null,null,null,null,null,null,null,null,null,null,null,null,null,null,""]
[]
[null,null,null,null,null,null,null,null,null,null,null,null,"Total",null,null,null,null,"Surveys",null,null,null,null,null,null,null,"Multsector\nAdd-on",null,null,null,null,"Indigo™ \nAdd-on",null,null,null,null,null,null,null,null,null,null,null,null,"Non-Particiption Fee",null,null,null,null,"NGO Global Pay",null,null,null,null,null,null,null,null,null,null,null,null,null,null,{"$f":"OrgName","v":0},{"$f":"OrderNumber","v":0},{"$f":"TotalIndigo","v":0},{"$f":"SUM(BO54:BO113)","v":0},{"$f":"SUM(BP54:BP113)","v":0},{"$f":"SUM(BQ54:BQ113)","v":{"$error":"#N/A"}},null,{"$f":"SUM(BS54:BS113)","v":0},null,{"$f":"SUM(BU54:BU113)","v":0},{"$f":"SUM(BV54:BV113)","v":0},{"$f":"SUM(BW54:BW113)","v":{"$error":"#N/A"}}]
[null,null,null,null,null,null,"1st Year",null,null,null,null,{"$f":"ROUND(SUM(R116:BC116),0)","v":{"$error":"#N/A"}},null,null,null,null,null,{"$f":"FirstYr*COUNTA(D$54:D$62)","v":{"$error":"#N/A"}},null,null,null,null,null,null,null,{"$f":"MSAddOn*SUM(AD54:AD62)","v":{"$error":"#N/A"}},null,null,null,null,{"$f":"Indigo*COUNTIF(AE54:AI62,\"=x\")","v":{"$error":"#N/A"}},null,null,null,null,null,null,null,null,null,null,null,null,{"$f":"SUM(AR54:AV113)","v":0},null,null,null,null,{"$f":"NGOGlobalPayFee","v":0},null,null,null,null,null,null,null,null,null,null,null,null,null,null,null,null,null,null,{"$f":"SUM(BP113:BT115)-SUM(CO113:CO115)","v":{"$error":"#N/A"}}]
[null,null,null,"2nd Year",null,null,null,null,null,null,null,{"$f":"ROUND(SUM(R117:BC117),0)","v":{"$error":"#N/A"}},null,null,null,null,null,{"$f":"SecondYr*COUNTA(D$54:D$62)","v":{"$error":"#N/A"}},null,null,null,null,null,null,null,{"$f":"Z116","v":{"$error":"#N/A"}},null,null,null,null,{"$f":"AE116","v":{"$error":"#N/A"}},null,null,null,null,null,null,null,null,null,null,null,null,{"$f":"AR116","v":0},null,null,null,null,{"$f":"NGOGlobalPayFee","v":0}]
[null,null,null,"3rd Year",null,null,null,null,null,null,null,{"$f":"ROUND(SUM(R118:BC118),0)","v":{"$error":"#N/A"}},null,null,null,null,null,{"$f":"ThirdYr*COUNTA(D$54:D$62)","v":{"$error":"#N/A"}},null,null,null,null,null,null,null,{"$f":"Z117","v":{"$error":"#N/A"}},null,null,null,null,{"$f":"AE117","v":{"$error":"#N/A"}},null,null,null,null,null,null,null,null,null,null,null,null,{"$f":"ROUND(R118*0.5,0)","v":{"$error":"#N/A"}},null,null,null,null,{"$f":"NGOGlobalPayFee","v":0}]
[null,null,null,"Total Fees :",null,null,null,null,null,null,null,{"$f":"ROUND(SUM(L116:P118),0)","v":{"$error":"#N/A"}}]
[]
[]
[null,null,null,null,"Note:  All fees are net of tax.  If any  income tax, withholding tax, VAT or similar taxes are payable, the invoice amount will be"]
[null,null,null,null,"increased (grossed-up) and taxes will be withheld from the resulting balance."]
[]
[null,null,null,null,{"$f":"\"Tax rate applicable in \"&IF(AF36=\"\",AF24,AF36)&\":\"","v":"Tax rate applicable in :"},null,null,null,null,null,null,null,null,null,null,null,null,null,null,null,{"$f":"_xlfn.IFNA(VLOOKUP(IF(AF36=\"\",AF24,AF36),GrossUps,2,FALSE)*IF(AC125=\"\",1,0),\"Not Applicable\")","v":"Not Applicable"},null,null,null,null,null,null,null,null,null,null,"Type X to cancel application of tax"]
[null,null,null,null,"Tax Gross-up Amount:",null,null,null,null,null,null,null,null,null,null,null,null,null,null,null,{"$f":"IF(U125=\"Not Applicable\",0,ROUND((L116/(1-U125))-L116,2))","v":0}]
[]
[]
[null,null,"Subscription Agreement"]
[null,null,"All data is sold via subscription for a 12-month period, beginning on the Subscription Start Date you entered on the first Order Form Page"]
[null,null,"Three survey updates are issued annually, in April, July and October.  Participants must contribute their organization's data once "]
[null,null,"  per year, within 60 days following annual pay review, or be subject to a non-participant surcharge (see Subscription Agreement, paragraph 18)."]
[]
[null,null,"All subscriptions require confirmation of Terms and Conditions via our Subscription Agreement.  "]
[]
[null,null,"Click HERE to review the Terms and Conditions and confirm your agreement."]
[]
[null,null,{"$f":"IF('Subscription Agreement'!$C$81=TRUE,\"Agreement Confirmed\",\"Agreement NOT Confirmed\")","v":"Agreement NOT Confirmed"},null,null,null,null,null,null,null,null,null,null,null,null,null,false]
[]
[null,null,"Notes / Special Billing Requests"]
[]
[]
[]
[]
[]
[]
[]
[]
[]
[null,null,null,"Country Information"]
[null,null,null,"Please indicate below, for each country in which you registered, the requested information.\nClick on the column header for further help."]
[null,null,null,"When finished, click on Go to Survey Access to continue."]
[null,null,null,null,{"$f":"COLUMN(E153)-4","v":1},null,null,null,null,null,null,null,null,{"$f":"COLUMN(N153)-4","v":10},null,null,null,null,null,null,null,null,{"$f":"COLUMN(W153)-4","v":19},null,null,null,null,null,null,null,null,{"$f":"COLUMN(AF153)-4","v":28}]
[null,null,null,null,null,null,null,null,null,null,null,null,null,null,null,null,null,null,null,null,null,null,null,null,null,null,null,null,null,null,null,"Pay Review Frequency",null,null,null,null,null,null,null,null,"Data Submission Month",null,null,null,null,null,null,null,null,"Data Submission Cycle"]
[null,null,null,null,"Survey Country",null,null,null,null,null,null,null,null,"Total Staff Count",null,null,null,null,null,null,null,null,"Next Pay Review Date"]
[null,null,null,null,null,null,null,null,null,null,null,null,null,null,null,null,null,null,null,null,null,null,null,null,null,null,null,null,null,null,null,null,null,null,null,null,null,null,null,null,null,null,null,null,null,null,null,null,null,{"$f":"IFERROR(VLOOKUP(AO156,DataCycles,2,FALSE),\"\")","v":""}]
[null,null,null,null,null,null,null,null,null,null,null,null,null,null,null,null,null,null,null,null,null,null,null,null,null,null,null,null,null,null,null,null,null,null,null,null,null,null,null,null,null,null,null,null,null,null,null,null,null,""]
[null,null,null,null,null,null,null,null,null,null,null,null,null,null,null,null,null,null,null,null,null,null,null,null,null,null,null,null,null,null,null,null,null,null,null,null,null,null,null,null,null,null,null,null,null,null,null,null,null,""]
[null,null,null,null,null,null,null,null,null,null,null,null,null,null,null,null,null,null,null,null,null,null,null,null,null,null,null,null,null,null,null,null,null,null,null,null,null,null,null,null,null,null,null,null,null,null,null,null,null,""]
[null,null,null,null,null,null,null,null,null,null,null,null,null,null,null,null,null,null,null,null,null,null,null,null,null,null,null,null,null,null,null,null,null,null,null,null,null,null,null,null,null,null,null,null,null,null,null,null,null,""]
[null,null,null,null,null,null,null,null,null,null,null,null,null,null,null,null,null,null,null,null,null,null,null,null,null,null,null,null,null,null,null,null,null,null,null,null,null,null,null,null,null,null,null,null,null,null,null,null,null,""]
[null,null,null,null,null,null,null,null,null,null,null,null,null,null,null,null,null,null,null,null,null,null,null,null,null,null,null,null,null,null,null,null,null,null,null,null,null,null,null,null,null,null,null,null,null,null,null,null,null,""]
[null,null,null,null,null,null,null,null,null,null,null,null,null,null,null,null,null,null,null,null,null,null,null,null,null,null,null,null,null,null,null,null,null,null,null,null,null,null,null,null,null,null,null,null,null,null,null,null,null,""]
[null,null,null,null,null,null,null,null,null,null,null,null,null,null,null,null,null,null,null,null,null,null,null,null,null,null,null,null,null,null,null,null,null,null,null,null,null,null,null,null,null,null,null,null,null,null,null,null,null,""]
[]
[]
[null,null,"RETURN COMPLETED FORM TO REGISTRATION@NGOLOCALPAY.NET"]
[]
[]
[null,null,"To complete your order, SAVE THIS FILE. "]
[]
[null,null,null,null,"Then, send an email to:",null,null,null,null,null,null,null,null,null,"registration@birchesgroup.com",null,null,null,null,null,null,null,null,null,null,null,null,"and ATTACH THIS FILE to your email."]
[]
[]
[null,null,"© 2013 Birches Group LLC"]

{"sheet":"Order Form (Ad-Hoc)","index":6,"n_rows":221,"n_cols":152,"rows_kept":221,"cut":false,"hidden":false,"merged":[[210,49,210,52],[211,49,211,52],[150,49,151,52],[201,49,201,52],[202,49,202,52],[203,49,203,52],[204,49,204,52],[205,49,205,52],[206,49,206,52],[207,49,207,52],[208,49,208,52],[209,49,209,52],[192,49,192,52],[193,49,193,52],[194,49,194,52],[195,49,195,52],[196,49,196,52],[197,49,197,52],[198,49,198,52],[199,49,199,52],[200,49,200,52],[183,49,183,52],[184,49,184,52],[185,49,185,52],[186,49,186,52],[187,49,187,52],[188,49,188,52],[189,49,189,52],[190,49,190,52],[191,49,191,52],[174,49,174,52],[175,49,175,52],[176,49,176,52],[177,49,177,52],[178,49,178,52],[179,49,179,52],[180,49,180,52],[181,49,181,52],[182,49,182,52],[165,49,165,52],[166,49,166,52],[167,49,167,52],[168,49,168,52],[169,49,169,52],[170,49,170,52],[171,49,171,52],[172,49,172,52],[173,49,173,52],[205,40,205,48],[206,40,206,48],[207,40,207,48],[208,40,208,48],[209,40,209,48],[210,40,210,48],[211,40,211,48],[152,49,152,52],[153,49,153,52],[154,49,154,52],[155,49,155,52],[156,49,156,52],[157,49,157,52],[158,49,158,52],[159,49,159,52],[160,49,160,52],[161,49,161,52],[162,49,162,52],[163,49,163,52],[164,49,164,52],[196,40,196,48],[197,40,197,48],[198,40,198,48],[199,40,199,48],[200,40,200,48],[201,40,201,48],[202,40,202,48],[203,40,203,48],[204,40,204,48],[187,40,187,48],[188,40,188,48],[189,40,189,48],[190,40,190,48],[191,40,191,48],[192,40,192,48],[193,40,193,48],[194,40,194,48],[195,40,195,48],[178,40,178,48],[179,40,179,48],[180,40,180,48],[181,40,181,48],[182,40,182,48],[183,40,183,48],[184,40,184,48],[185,40,185,48],[186,40,186,48],[169,40,169,48],[170,40,170,48],[171,40,171,48],[172,40,172,48],[173,40,173,48],[174,40,174,48],[175,40,175,48],[176,40,176,48],[177,40,177,48],[160,40,160,48],[161,40,161,48],[162,40,162,48],[163,40,163,48],[164,40,164,48],[165,40,165,48],[166,40,166,48],[167,40,167,48],[168,40,168,48],[150,40,151,48],[152,40,152,48],[153,40,153,48],[154,40,154,48],[155,40,155,48],[156,40,156,48],[157,40,157,48],[158,40,158,48],[159,40,159,48],[31,2,31,11],[31,14,31,23],[31,27,31,36],[31,39,31,57],[34,6,34,23],[34,31,34,57],[40,2,40,7],[40,8,40,17],[43,3,43,54],[39,2,39,7],[39,8,39,17],[49,73,49,74],[49,76,49,78],[121,4,121,19],[121,20,121,25],[51,3,51,10],[51,12,51,15],[51,17,51,24],[51,44,51,51],[51,30,51,34],[53,53,53,57],[54,12,54,15],[54,17,54,24],[54,53,54,57],[53,30,53,34],[54,30,54,34],[51,53,51,57],[52,30,52,34],[52,25,52,29],[52,17,52,24],[52,3,52,10],[52,12,52,15],[53,12,53,15],[53,17,53,24],[53,25,53,28],[9,1,9,57],[10,2,10,57],[11,2,12,57],[14,2,14,57],[16,2,16,23],[16,25,16,26],[16,27,16,36],[16,39,16,57],[22,2,22,5],[22,6,22,23],[22,27,22,30],[22,31,22,57],[17,2,17,12],[17,25,17,26],[17,27,17,36],[17,39,17,57],[19,2,19,11],[19,14,19,23],[19,27,19,36],[19,39,19,57],[45,3,45,55],[46,3,46,55],[49,3,49,52],[35,6,35,23],[35,31,35,36],[35,44,35,57],[36,14,36,23],[38,27,38,57],[41,8,41,17],[38,2,38,23],[39,18,39,23],[47,3,47,55],[24,2,24,13],[24,14,24,23],[28,2,28,23],[28,25,28,26],[28,27,28,36],[28,39,28,57],[23,2,23,5],[23,6,23,23],[23,27,23,30],[23,31,23,36],[23,44,23,57],[57,12,57,15],[57,17,57,24],[57,53,57,57],[57,30,57,34],[57,25,57,28],[58,25,58,28],[52,53,52,57],[54,25,54,28],[56,53,56,57],[56,30,56,34],[55,12,55,15],[55,17,55,24],[55,53,55,57],[55,30,55,34],[55,25,55,28],[56,25,56,28],[56,12,56,15],[56,17,56,24],[58,12,58,15],[58,17,58,24],[52,44,52,51],[59,12,59,15],[59,17,59,24],[59,53,59,57],[59,30,59,34],[59,25,59,28],[60,25,60,28],[60,36,60,43],[58,53,58,57],[58,30,58,34],[60,12,60,15],[60,17,60,24],[61,12,61,15],[61,17,61,24],[61,53,61,57],[61,30,61,34],[61,25,61,28],[62,25,62,28],[61,36,61,43],[62,36,62,43],[60,53,60,57],[60,30,60,34],[62,12,62,15],[62,17,62,24],[63,12,63,15],[63,17,63,24],[63,53,63,57],[63,30,63,34],[63,25,63,28],[64,25,64,28],[63,36,63,43],[64,36,64,43],[62,53,62,57],[62,30,62,34],[65,12,65,15],[65,17,65,24],[65,53,65,57],[65,30,65,34],[65,25,65,28],[66,25,66,28],[65,36,65,43],[66,36,66,43],[64,12,64,15],[64,17,64,24],[64,53,64,57],[64,30,64,34],[67,12,67,15],[67,17,67,24],[67,53,67,57],[67,30,67,34],[67,25,67,28],[68,25,68,28],[67,36,67,43],[68,36,68,43],[66,12,66,15],[66,17,66,24],[66,53,66,57],[66,30,66,34],[69,12,69,15],[69,17,69,24],[69,53,69,57],[69,30,69,34],[69,25,69,28],[70,25,70,28],[69,36,69,43],[70,36,70,43],[68,12,68,15],[68,17,68,24],[68,53,68,57],[68,30,68,34],[71,12,71,15],[71,17,71,24],[71,53,71,57],[71,30,71,34],[71,25,71,28],[72,25,72,28],[71,36,71,43],[72,36,72,43],[70,12,70,15],[70,17,70,24],[70,53,70,57],[70,30,70,34],[73,12,73,15],[73,17,73,24],[73,53,73,57],[73,30,73,34],[73,25,73,28],[74,25,74,28],[73,36,73,43],[74,36,74,43],[72,12,72,15],[72,17,72,24],[72,53,72,57],[72,30,72,34],[75,12,75,15],[75,17,75,24],[75,53,75,57],[75,30,75,34],[75,25,75,28],[76,25,76,28],[75,36,75,43],[76,36,76,43],[74,12,74,15],[74,17,74,24],[74,53,74,57],[74,30,74,34],[77,12,77,15],[77,17,77,24],[77,53,77,57],[77,30,77,34],[77,25,77,28],[78,25,78,28],[77,36,77,43],[78,36,78,43],[76,12,76,15],[76,17,76,24],[76,53,76,57],[76,30,76,34],[79,12,79,15],[79,17,79,24],[79,53,79,57],[79,30,79,34],[79,25,79,28],[80,25,80,28],[79,36,79,43],[80,36,80,43],[78,12,78,15],[78,17,78,24],[78,53,78,57],[78,30,78,34],[81,12,81,15],[81,17,81,24],[81,53,81,57],[81,30,81,34],[81,25,81,28],[82,25,82,28],[81,36,81,43],[82,36,82,43],[80,12,80,15],[80,17,80,24],[80,53,80,57],[80,30,80,34],[83,12,83,15],[83,17,83,24],[83,53,83,57],[83,30,83,34],[83,25,83,28],[84,25,84,28],[83,36,83,43],[84,36,84,43],[82,12,82,15],[82,17,82,24],[82,53,82,57],[82,30,82,34],[85,12,85,15],[85,17,85,24],[85,53,85,57],[85,30,85,34],[85,25,85,28],[86,25,86,28],[85,36,85,43],[86,36,86,43],[84,12,84,15],[84,17,84,24],[84,53,84,57],[84,30,84,34],[87,12,87,15],[87,17,87,24],[87,53,87,57],[87,30,87,34],[87,25,87,28],[88,25,88,28],[87,36,87,43],[88,36,88,43],[86,12,86,15],[86,17,86,24],[86,53,86,57],[86,30,86,34],[89,12,89,15],[89,17,89,24],[89,53,89,57],[89,30,89,34],[89,25,89,28],[90,25,90,28],[89,36,89,43],[90,36,90,43],[88,12,88,15],[88,17,88,24],[88,53,88,57],[88,30,88,34],[91,12,91,15],[91,17,91,24],[91,53,91,57],[91,30,91,34],[91,25,91,28],[92,25,92,28],[91,36,91,43],[92,36,92,43],[90,12,90,15],[90,17,90,24],[90,53,90,57],[90,30,90,34],[93,12,93,15],[93,17,93,24],[93,53,93,57],[93,30,93,34],[93,25,93,28],[94,25,94,28],[93,36,93,43],[94,36,94,43],[92,12,92,15],[92,17,92,24],[92,53,92,57],[92,30,92,34],[95,12,95,15],[95,17,95,24],[95,53,95,57],[95,30,95,34],[95,25,95,28],[96,25,96,28],[95,36,95,43],[96,36,96,43],[94,12,94,15],[94,17,94,24],[94,53,94,57],[94,30,94,34],[97,12,97,15],[97,17,97,24],[97,53,97,57],[97,30,97,34],[97,25,97,28],[98,25,98,28],[97,36,97,43],[98,36,98,43],[96,12,96,15],[96,17,96,24],[96,53,96,57],[96,30,96,34],[99,12,99,15],[99,17,99,24],[99,53,99,57],[99,30,99,34],[99,25,99,28],[100,25,100,28],[99,36,99,43],[100,36,100,43],[98,12,98,15],[98,17,98,24],[98,53,98,57],[98,30,98,34],[101,12,101,15],[101,17,101,24],[101,53,101,57],[101,30,101,34],[101,25,101,28],[102,25,102,28],[101,36,101,43],[102,36,102,43],[100,12,100,15],[100,17,100,24],[100,53,100,57],[100,30,100,34],[103,12,103,15],[103,17,103,24],[103,53,103,57],[103,30,103,34],[103,25,103,28],[104,25,104,28],[103,36,103,43],[104,36,104,43],[102,12,102,15],[102,17,102,24],[102,53,102,57],[102,30,102,34],[105,12,105,15],[105,17,105,24],[105,53,105,57],[105,30,105,34],[105,25,105,28],[106,25,106,28],[105,36,105,43],[106,36,106,43],[104,12,104,15],[104,17,104,24],[104,53,104,57],[104,30,104,34],[107,12,107,15],[107,17,107,24],[107,53,107,57],[107,30,107,34],[107,25,107,28],[108,25,108,28],[107,36,107,43],[108,36,108,43],[106,12,106,15],[106,17,106,24],[106,53,106,57],[106,30,106,34],[109,12,109,15],[109,17,109,24],[109,53,109,57],[109,30,109,34],[109,25,109,28],[110,25,110,28],[109,36,109,43],[110,36,110,43],[108,12,108,15],[108,17,108,24],[108,53,108,57],[108,30,108,34],[113,44,113,51],[111,53,111,57],[111,30,111,34],[111,25,111,28],[112,25,112,28],[112,53,112,57],[111,36,111,43],[112,36,112,43],[110,12,110,15],[110,17,110,24],[110,53,110,57],[110,30,110,34],[111,12,111,15],[111,17,111,24],[112,30,112,34],[115,12,115,15],[115,17,115,23],[113,12,113,15],[116,11,116,16],[154,4,154,12],[154,13,154,21],[154,22,154,30],[154,31,154,39],[152,4,152,12],[152,13,152,21],[152,22,152,30],[152,31,152,39],[153,4,153,12],[153,13,153,21],[153,22,153,30],[153,31,153,39],[122,4,122,19],[122,20,122,25],[133,2,133,29],[156,4,156,12],[156,13,156,21],[156,22,156,30],[156,31,156,39],[157,4,157,12],[157,13,157,21],[157,22,157,30],[157,31,157,39],[155,4,155,12],[155,13,155,21],[155,22,155,30],[155,31,155,39],[160,4,160,12],[160,13,160,21],[160,22,160,30],[160,31,160,39],[161,4,161,12],[161,13,161,21],[161,22,161,30],[161,31,161,39],[158,4,158,12],[158,13,158,21],[158,22,158,30],[158,31,158,39],[159,4,159,12],[159,13,159,21],[159,22,159,30],[159,31,159,39],[164,4,164,12],[164,13,164,21],[164,22,164,30],[164,31,164,39],[165,4,165,12],[165,13,165,21],[165,22,165,30],[165,31,165,39],[162,4,162,12],[162,13,162,21],[162,22,162,30],[162,31,162,39],[163,4,163,12],[163,13,163,21],[163,22,163,30],[163,31,163,39],[168,4,168,12],[168,13,168,21],[168,22,168,30],[168,31,168,39],[169,4,169,12],[169,13,169,21],[169,22,169,30],[169,31,169,39],[166,4,166,12],[166,13,166,21],[166,22,166,30],[166,31,166,39],[167,4,167,12],[167,13,167,21],[167,22,167,30],[167,31,167,39],[172,4,172,12],[172,13,172,21],[172,22,172,30],[172,31,172,39],[173,4,173,12],[173,13,173,21],[173,22,173,30],[173,31,173,39],[170,4,170,12],[170,13,170,21],[170,22,170,30],[170,31,170,39],[171,4,171,12],[171,13,171,21],[171,22,171,30],[171,31,171,39],[176,4,176,12],[176,13,176,21],[176,22,176,30],[176,31,176,39],[177,4,177,12],[177,13,177,21],[177,22,177,30],[177,31,177,39],[174,4,174,12],[174,13,174,21],[174,22,174,30],[174,31,174,39],[175,4,175,12],[175,13,175,21],[175,22,175,30],[175,31,175,39],[180,4,180,12],[180,13,180,21],[180,22,180,30],[180,31,180,39],[181,4,181,12],[181,13,181,21],[181,22,181,30],[181,31,181,39],[178,4,178,12],[178,13,178,21],[178,22,178,30],[178,31,178,39],[179,4,179,12],[179,13,179,21],[179,22,179,30],[179,31,179,39],[184,4,184,12],[184,13,184,21],[184,22,184,30],[184,31,184,39],[185,4,185,12],[185,13,185,21],[185,22,185,30],[185,31,185,39],[182,4,182,12],[182,13,182,21],[182,22,182,30],[182,31,182,39],[183,4,183,12],[183,13,183,21],[183,22,183,30],[183,31,183,39],[188,4,188,12],[188,13,188,21],[188,22,188,30],[188,31,188,39],[189,4,189,12],[189,13,189,21],[189,22,189,30],[189,31,189,39],[186,4,186,12],[186,13,186,21],[186,22,186,30],[186,31,186,39],[187,4,187,12],[187,13,187,21],[187,22,187,30],[187,31,187,39],[193,31,193,39],[190,4,190,12],[190,13,190,21],[190,22,190,30],[190,31,190,39],[191,4,191,12],[191,13,191,21],[191,22,191,30],[191,31,191,39],[214,2,214,57],[115,36,115,41],[116,36,116,41],[207,13,207,21],[207,22,207,30],[203,31,203,39],[204,4,204,12],[200,4,200,12],[200,13,200,21],[200,22,200,30],[200,31,200,39],[201,4,201,12],[201,13,201,21],[201,22,201,30],[201,31,201,39],[203,22,203,30],[207,31,207,39],[204,13,204,21],[204,31,204,39],[205,4,205,12],[205,13,205,21],[205,22,205,30],[199,4,199,12],[199,13,199,21],[194,4,194,12],[194,13,194,21],[194,22,194,30],[195,4,195,12],[195,13,195,21],[210,31,210,39],[211,31,211,39],[115,53,115,57],[116,53,116,57],[208,31,208,39],[209,31,209,39],[199,22,199,30],[199,31,199,39],[196,4,196,12],[196,13,196,21],[196,22,196,30],[196,31,196,39],[197,4,197,12],[197,13,197,21],[197,22,197,30],[197,31,197,39],[193,4,193,12],[193,13,193,21],[193,22,193,30],[195,31,195,39],[192,4,192,12],[192,13,192,21],[192,22,192,30],[192,31,192,39],[217,14,217,25],[51,25,51,29],[210,4,210,12],[210,13,210,21],[210,22,210,30],[211,4,211,12],[211,13,211,21],[211,22,211,30],[208,4,208,12],[208,13,208,21],[208,22,208,30],[209,4,209,12],[209,13,209,21],[209,22,209,30],[206,4,206,12],[206,13,206,21],[206,22,206,30],[112,17,112,24],[204,22,204,30],[202,31,202,39],[198,4,198,12],[198,13,198,21],[198,22,198,30],[198,31,198,39],[49,64,49,68],[49,69,49,72],[203,4,203,12],[203,13,203,21],[116,17,116,23],[112,12,112,15],[129,2,129,57],[131,2,131,57],[128,2,128,57],[125,2,125,57],[126,2,126,57],[127,2,127,57],[115,25,115,29],[116,25,116,29],[115,30,115,34],[116,30,116,34],[113,53,113,57],[194,31,194,39],[195,22,195,30],[51,114,51,122],[51,123,51,124],[51,125,51,134],[51,85,51,95],[51,96,51,113],[207,4,207,12],[137,2,143,57],[205,31,205,39],[202,4,202,12],[202,13,202,21],[206,31,206,39],[115,44,115,51],[116,44,116,51],[146,3,146,57],[147,3,147,57],[150,31,151,39],[151,4,151,12],[151,13,151,21],[151,22,151,30],[148,3,148,39],[116,6,116,10],[121,27,121,29],[121,30,121,55],[202,22,202,30],[51,36,51,43],[52,36,52,43],[53,36,53,43],[54,36,54,43],[55,36,55,43],[56,36,56,43],[57,36,57,43],[58,36,58,43],[59,36,59,43]]}
[]
[]
[]
[]
[]
[]
[]
[]
[]
[null,"Community™ Market Compensation & Benefits Survey"]
[null,null,"Registration Form for NGOs and Commercial Development Organizations"]
[null,null,"Please fill out this form completely in order to ensure your subscription can be processed quickly"]
[]
[]
[]
[null,null,"Purchase Authorized by"]
[null,null,{"$f":"IF(ISBLANK(OrgName),\"\",OrgName)","v":""},null,null,null,null,null,null,null,null,null,null,null,null,null,null,null,null,null,null,null,null,null,null,{"$f":"IF(ISBLANK(SubscriberSalutation),\"\",SubscriberSalutation)","v":""},null,{"$f":"IF(ISBLANK(SubscriberFirstName),\"\",SubscriberFirstName)","v":""},null,null,null,null,null,null,null,null,null,null,null,{"$f":"IF(ISBLANK(SubscriberLastName),\"\",SubscriberLastName)","v":""}]
[null,null,"Organization (Subscriber)",null,null,null,null,null,null,null,null,null,null,null,null,null,null,null,null,null,null,null,null,null,null,"Title",null,"Given Name(s)",null,null,null,null,null,null,null,null,null,null,null,"Surname(s)"]
[]
[null,null,{"$f":"IF(ISBLANK(SubscriberTitle),\"\",SubscriberTitle)","v":""},null,null,null,null,null,null,null,null,null,null,null,{"$f":"IF(ISBLANK(SubscriberEmail),\"\",SubscriberEmail)","v":""},null,null,null,null,null,null,null,null,null,null,null,null,{"$f":"IF(ISBLANK(SubscriberPhone),\"\",SubscriberPhone)","v":""},null,null,null,null,null,null,null,null,null,null,null,{"$f":"IF(ISBLANK(SubscriberSkype),\"\",SubscriberSkype)","v":""}]
[null,null,"Job Title",null,null,null,null,null,null,null,null,null,null,null,"Email",null,null,null,null,null,null,null,null,null,null,null,null,"Phone (including country code)",null,null,null,null,null,null,null,null,null,null,null,"Skype Address"]
[]
[null,null,"Address 1",null,null,null,{"$f":"IF(ISBLANK(SubscriberAddress1),\"\",SubscriberAddress1)","v":""},null,null,null,null,null,null,null,null,null,null,null,null,null,null,null,null,null,null,null,null,"Address 2",null,null,null,{"$f":"IF(ISBLANK(SubscriberAddress2),\"\",SubscriberAddress2)","v":""}]
[null,null,"City",null,null,null,{"$f":"IF(ISBLANK(SubscriberCity),\"\",SubscriberCity)","v":""},null,null,null,null,null,null,null,null,null,null,null,null,null,null,null,null,null,null,null,null,"Country",null,null,null,{"$f":"IF(ISBLANK(SubscriberCountry),\"\",SubscriberCountry)","v":""},null,null,null,null,null,null,null,"Postal Code",null,null,null,null,{"$f":"IF(ISBLANK(SubscriberPostalCode),\"\",SubscriberPostalCode)","v":""}]
[null,null,"State/Province (US/Canada only)",null,null,null,null,null,null,null,null,null,null,null,{"$f":"IF(ISBLANK(SubscriberState),\"\",SubscriberState)","v":""}]
[]
[]
[null,null,"Billing Contact Information (if different than purchaser)"]
[null,null,{"$f":"IF(ISBLANK(BillingOrgName),\"\",BillingOrgName)","v":""},null,null,null,null,null,null,null,null,null,null,null,null,null,null,null,null,null,null,null,null,null,null,{"$f":"IF(ISBLANK(BillingSalutation),\"\",BillingSalutation)","v":""},null,{"$f":"IF(ISBLANK(BillingGivenNames),\"\",BillingGivenNames)","v":""},null,null,null,null,null,null,null,null,null,null,null,{"$f":"IF(ISBLANK(BillingSurnames),\"\",BillingSurnames)","v":""}]
[null,null,"Company",null,null,null,null,null,null,null,null,null,null,null,null,null,null,null,null,null,null,null,null,null,null,"Title",null,"Given Name(s)",null,null,null,null,null,null,null,null,null,null,null,"Surname(s)"]
[]
[null,null,{"$f":"IF(ISBLANK(BillingJobTitle),\"\",BillingJobTitle)","v":""},null,null,null,null,null,null,null,null,null,null,null,{"$f":"IF(ISBLANK(BillingEmail),\"\",BillingEmail)","v":""},null,null,null,null,null,null,null,null,null,null,null,null,{"$f":"IF(ISBLANK(BillingPhone),\"\",BillingPhone)","v":""},null,null,null,null,null,null,null,null,null,null,null,{"$f":"IF(ISBLANK(BillingSkype),\"\",BillingSkype)","v":""}]
[null,null,"Job Title",null,null,null,null,null,null,null,null,null,null,null,"Email",null,null,null,null,null,null,null,null,null,null,null,null,"Phone (including country code)",null,null,null,null,null,null,null,null,null,null,null,"Skype Address"]
[]
[null,null,"Address 1",null,null,null,{"$f":"IF(ISBLANK(BillingAddress1),\"\",BillingAddress1)","v":""},null,null,null,null,null,null,null,null,null,null,null,null,null,null,null,null,null,null,null,null,"Address 2",null,null,null,{"$f":"IF(ISBLANK(BillingAddress2),\"\",BillingAddress2)","v":""}]
[null,null,"City",null,null,null,{"$f":"IF(ISBLANK(BillingCity),\"\",BillingCity)","v":""},null,null,null,null,null,null,null,null,null,null,null,null,null,null,null,null,null,null,null,null,"Country",null,null,null,{"$f":"IF(ISBLANK(BillingCountry),\"\",BillingCountry)","v":""},null,null,null,null,null,null,null,"Postal Code",null,null,null,null,{"$f":"IF(ISBLANK(BillingPostalCode),\"\",BillingPostalCode)","v":""}]
[null,null,"State/Province (US/Canada only)",null,null,null,null,null,null,null,null,null,null,null,{"$f":"IF(ISBLANK(BillingState),\"\",BillingState)","v":""}]
[]
[null,null,"(Birches Group use only)",null,null,null,null,null,null,null,null,null,null,null,null,null,null,null,null,null,null,null,null,null,null,null,null,{"$f":"IF(ISBLANK(PurchaseOrderNo),\"\",PurchaseOrderNo)","v":""}]
[null,null,"Account Number:",null,null,null,null,null,{"$f":"AccountNumber","v":0},null,null,null,null,null,null,null,null,null,{"$f":"'Order Form'!U61","v":"USD"},null,null,null,null,null,null,null,null,"Purchase Order Number (optional)"]
[null,null,"Order Number:",null,null,null,null,null,{"$f":"OrderNumber","v":0}]
[null,null,"Effective Date:",null,null,null,null,null,{"$f":"'Order Form'!SubscriptionStartDate","v":"00:00:00"}]
[]
[null,null,null,"For each of the countries you have selected, please indicate the following information:",null,null,null,null,null,null,null,null,null,null,null,null,null,null,null,null,null,null,null,null,null,null,null,null,null,null,null,null,null,null,null,null,null,null,null,null,null,null,null,null,null,null,null,null,null,null,null,null,null,null,null,null,null,null,null,null,null,null,null,null,null,null,null,null,null,null,null,null,null,null,null,null,null,null,null,null,null,null,null,null,null,"Export area for Reg Database",null,null,null,null,null,null,null,null,null,null,null,null,null,null,null,null,null,null,null,null,null,null,null,null,null,null,null,null,null,null,null,null,null,null,null,null,null,null,null,null,null,null,null,null,null,null,null,null,null,null,null,null,null,null,null,null,"These are working columns, will be hidden when finished with coding"]
[]
[null,null,null,"  1)  Data Submission.  Indicate Yes or No for Data Submission.  Note there is an additional fee if you do not submit your data,",null,null,null,null,null,null,null,null,null,null,null,null,null,null,null,null,null,null,null,null,null,null,null,null,null,null,null,null,null,null,null,null,null,null,null,null,null,null,null,null,null,null,null,null,null,null,null,null,null,null,null,null,null,null,null,null,null,null,null,null,"Organization Name","Account Number","Order Number","Billing Contact","Billing Title","Address1","Address2","Billing State","Billing City","Billing Postal Code","Billing Country","Billing Phone","Billing E-Mail","Organization Type","Subscription Type","Subscription Start Date","Subscription End Date","Currency","Purchase Order"]
[null,null,null,"  2)  Multisector Add-on and Indigo™ Add-on.  For each country, indicate if you wish to include these options.",null,null,null,null,null,null,null,null,null,null,null,null,null,null,null,null,null,null,null,null,null,null,null,null,null,null,null,null,null,null,null,null,null,null,null,null,null,null,null,null,null,null,null,null,null,null,null,null,null,null,null,null,null,null,null,null,null,null,null,null,{"$f":"C17","v":""},{"$f":"AccountNumber","v":0},{"$f":"I41","v":0},{"$f":"IF(AB29=\"\",Z17&\" \"&AB17&\" \"&AN17,Z29&\" \"&AB29&\" \"&AN29)","v":"  "},{"$f":"IF(C32=\"\",C20,C32)","v":""},{"$f":"IF(G35=\"\",G23,G35)","v":""},{"$f":"IF(AF35=\"\",AF23,AF35)","v":""},{"$f":"IF(O37=\"\",IF(O25=\"\",\"\", \", \"&VLOOKUP(O25,StateAbbr,2,FALSE)), \", \"&VLOOKUP(O37,StateAbbr,2,FALSE))","v":""},{"$f":"IF(G36=\"\",G24,G36)","v":""},{"$f":"IF(AS36=\"\",AS24,AS36)","v":""},{"$f":"IF(AF36=\"\",AF24,AF36)","v":""},{"$f":"IF(AB32=\"\",AB20,AB32)","v":""},{"$f":"IF(O32=\"\",O20,O32)","v":""},{"$f":"'Order Form'!L101","v":"Type of Organization"},{"$f":"ProductOption","v":"Product Option"},{"$f":"'Order Form'!L105","v":"00:00:00"},{"$f":"DATE(YEAR(CB47)+1,MONTH(CB47), DAY(CB47)-1)","v":"1900-12-30"},{"$f":"Currency","v":"USD"},{"$f":"IF(ISBLANK(PurchaseOrderNo),\"\",PurchaseOrderNo)","v":""}]
[null,null,null,"  3)  Custom Cut.  For each country, indicate if you would like to add a Custom Cut to your subscription.  First custom cut is free."]
[null,null,null,null,null,null,null,null,null,null,null,null,null,null,null,null,null,null,null,null,null,null,null,null,null,null,null,null,null,null,null,null,null,null,null,null,null,null,null,null,null,null,null,null,null,null,null,null,null,null,null,null,null,null,null,null,null,null,null,null,null,null,null,null,"cc Emails",null,null,null,null,"Sales Rep"]
[null,null,null,"Note:  You can use copy/paste commands, or drag values down, to copy information to multiple lines.",null,null,null,null,null,null,null,null,null,null,null,null,null,null,null,null,null,null,null,null,null,null,null,null,null,null,null,null,null,null,null,null,null,null,null,null,null,null,null,null,null,null,null,null,null,null,null,null,null,null,null,null,null,null,null,null,null,null,null,null,{"$f":"ccemails","v":0},null,null,null,null,{"$f":"IF(ISBLANK(SalesRep),\"support@birchesgroup.com\",SalesRep)","v":"support@birchesgroup.com"},null,null,null,{"$f":"IF(NGOGPChoice=\"no\",\"\",\"Data:NGO Global Pay:Subscription\")","v":""},null,{"$f":"IF(NGOGPChoice=\"No\",\"\",NGOGlobalPayFee)","v":""},{"$f":"IF(M114=\"No\",\"Data:NGO Global Pay:Non-Participant Surcharge\",\"\")","v":""},null,null,{"$f":"BB114","v":0}]
[null,null,null,null,null,null,null,null,null,null,null,null,null,null,null,null,null,null,null,null,null,null,null,null,null,null,null,null,null,null,null,null,null,null,null,null,null,null,null,null,null,null,null,null,null,null,null,null,null,null,null,null,null,null,null,null,null,null,null,null,null,null,null,null,"Tax Gross-Up",{"$f":"U123","v":0}]
[null,null,null,"Country",null,null,null,null,null,null,null,null,"Will You Submit Data (Y/N)?",null,null,null,null,"Profiles Available",null,null,null,null,null,null,null,{"$f":"\"Multisector \nAdd-on\"&\" (\"&\nTEXT(MSAddOn,\"$#,##0\")&\")\"","v":{"$error":"#N/A"}},null,null,null,null,{"$f":"\"Indigo™\nAdd-on (\"&TEXT(Indigo,\"$#,##0\")&\")\"","v":{"$error":"#N/A"}},null,null,null,null,null,"Custom Cuts",null,null,null,null,null,null,null,"NGO Global Pay",null,null,null,null,null,null,null,"Expedited Reports","Non-Participation Surcharge*\n(50% of survey fees)",null,null,null,null,null,null,null,null,null,null,null,null,null,null,null,null,null,null,null,null,null,null,null,null,null,null,null,null,null,null,null,"Information about the person who responded ",null,null,null,null,null,null,null,null,null,null,"Survey Data Contacts",null,null,null,null,null,null,null,null,null,null,null,null,null,null,null,null,null,"HQ/Regional Contacts",null,null,null,null,null,null,null,null,"Survey\nAccess",null,"Billing"]
[null,null,null,null,null,null,null,null,null,null,null,null,"choose",null,null,null,null,null,null,null,null,null,null,null,null,"choose",null,null,null,null,"choose",null,null,null,null,null,"choose",null,null,null,null,null,null,null,null,null,null,null,null,null,null,null,"choose",null,null,null,null,null,null,null,null,null,null,null,"Organization Name","Order Number","Class","Data:Annual Report Purchase:Country Report","Data:Annual Report Purchase:Indigo Add-On","Data:Annual Report Purchase:Multisector Add On","Custom Cut Description","Data:Specialized Data:Custom Cut","SubsectorName","Data:Specialized Data:Subsector Cut","Data:General Fees:Non-Participant Fee","Data:General Fees:Expedited Report Fee","Group Total",null,null,null,null,null,null,null,null,"Date Registered","Salutation (Mr/Ms)","First or Given Name","Last or Family Name","Name of Organization","Your Job Title","Country in which you are Located","Phone number (including country code)","Email Address","Skype Address","Number of Countries:","Country Name","Salutation (Mr/Ms)","First or Given Name","Last or Family Name","Name of Organization","Job Title","Country","Phone number (including country code)","Email Address","Skype Address - LCL","Response","EE Threshold","Next Pay Review Date","Pay Review Frequency","Survey Year","Country-Year","Survey Status","UniqueKey","Salutation (Mr/Ms)","First or Given Name","Last or Family Name","Name of Organization","Job Title","Country","Phone number (including country code)","Email Address","Skype Address - HQ","Name","E-mail Address","Send invoice to","Salutation (Mr/Ms)","First or Given Name","Last or Family Name","Name of Organization","Job Title","Country","Phone number (including country code)","Email Address","Skype Address - Billing","Notes","Response","Will provide data?","Preferred Partner?","Fee applies",null,null,"Main Product","Start Date","End Date","Pricing","MS Add-on","Custom Cut","Subsector (Subsector Name)","Participate"]
[null,null,1,null,null,null,null,null,null,null,null,null,null,null,null,null,null,{"$f":"IF(ISNA(VLOOKUP($D54,SurveyElections,2,FALSE)),\"\",VLOOKUP($D54,SurveyElections,2,FALSE))","v":""},null,null,null,null,null,null,null,null,null,null,null,{"$f":"IF(AND(Z54=\"x\",R54=\"NGOLP & Multisector\"),1,0)","v":0},null,null,null,null,null,null,null,null,null,null,null,null,null,null,null,null,null,null,null,null,null,null,null,{"$f":"IFERROR(ROUND(IF(ISBLANK(D54),\"\",IF(M54=\"Yes\",0,NGOLPSurvey*0.5)),0),\"\")","v":""},null,null,null,null,null,null,null,null,null,null,{"$f":"OrgName","v":0},{"$f":"OrderNumber","v":0},{"$f":"IF(ISBLANK(D54),\"\",D54)","v":""},{"$f":"IF(ISBLANK(D54),\"\",NGOLPSurvey)","v":""},{"$f":"IF(ISBLANK(AE54),0,Indigo)","v":0},{"$f":"AD54*MSAddOn","v":{"$error":"#N/A"}},{"$f":"IF(ISBLANK(AK54),\"\",AK54)","v":""},{"$f":"IF(AK54=\"All Cycles\",CustomAll,0)+IF(OR(AK54=\"Cycle 1 (Apr)\", AK54=\"Cycle 2 (Jul)\", AK54=\"Cycle 3 (Oct)\"),Custom,0)","v":0},null,null,{"$f":"IF(M54=\"Yes\",\"\",BB54)","v":""},{"$f":"IF(BA54=\"Yes\",450,\"\")","v":""},{"$f":"SUM(BW54,BP54,BT54,BV54,BQ54,BR54,BX54)","v":{"$error":"#N/A"}},null,null,null,null,null,null,null,null,{"$f":"TODAY()","v":"2021-03-18"},{"$f":"$Z$17","v":""},{"$f":"$AB$17","v":""},{"$f":"$AN$17","v":""},{"$f":"$C$17","v":""},{"$f":"$C$20","v":""},{"$f":"$AF$24","v":""},{"$f":"$AB$20","v":""},{"$f":"$O$20","v":""},{"$f":"$AN$20","v":""},{"$f":"TotalIndigo","v":0},{"$f":"D54","v":0},{"$f":"VLOOKUP($CS54,SurveyDataContacts,'Survey Contacts'!$L$24,FALSE)","v":{"$error":"#N/A"}},{"$f":"VLOOKUP($CS54,SurveyDataContacts,'Survey Contacts'!$T$24,FALSE)","v":{"$error":"#N/A"}},{"$f":"VLOOKUP($CS54,SurveyDataContacts,'Survey Contacts'!$AL$24,FALSE)","v":{"$error":"#N/A"}},{"$f":"CL54","v":""},{"$f":"VLOOKUP($CS54,SurveyDataContacts,'Survey Contacts'!$BD$24,FALSE)","v":{"$error":"#N/A"}},{"$f":"VLOOKUP($CS54,SurveyDataContacts,'Survey Contacts'!$DS$24,FALSE)","v":{"$error":"#N/A"}},{"$f":"VLOOKUP($CS54,SurveyDataContacts,'Survey Contacts'!$BV$24,FALSE)","v":{"$error":"#N/A"}},{"$f":"VLOOKUP($CS54,SurveyDataContacts,'Survey Contacts'!$CQ$24,FALSE)","v":{"$error":"#N/A"}},{"$f":"VLOOKUP($CS54,SurveyDataContacts,'Survey Contacts'!$DE$24,FALSE)","v":{"$error":"#N/A"}},{"$f":"VLOOKUP($CS54,CountryInformation_Ad_Hoc,$N$150,FALSE)","v":{"$error":"#N/A"}},{"$f":"IF(DC54<16,\"15 or Less\",\"More than 15\")","v":{"$error":"#N/A"}},{"$f":"VLOOKUP($CS54,CountryInformation_Ad_Hoc,$W$150,FALSE)","v":{"$error":"#N/A"}},{"$f":"VLOOKUP($CS54,CountryInformation_Ad_Hoc,$AF$150,FALSE)","v":{"$error":"#N/A"}},{"$f":"YEAR($I$42)","v":1900},{"$f":"CS54&\" - \"&DG54","v":"0 - 1900"},null,{"$f":"CW54&CS54&DG54","v":"01900"},{"$f":"VLOOKUP($D54,HQ_Contacts,'HQ and Regional Contacts'!$Q$24,FALSE)","v":{"$error":"#N/A"}},{"$f":"VLOOKUP($D54,HQ_Contacts,'HQ and Regional Contacts'!$Y$24,FALSE)","v":{"$error":"#N/A"}},{"$f":"VLOOKUP($D54,HQ_Contacts,'HQ and Regional Contacts'!$AQ$24,FALSE)","v":{"$error":"#N/A"}},{"$f":"CW54","v":""},{"$f":"VLOOKUP($D54,HQ_Contacts,'HQ and Regional Contacts'!$BI$24,FALSE)","v":{"$error":"#N/A"}},{"$f":"VLOOKUP($D54,HQ_Contacts,'HQ and Regional Contacts'!$DX$24,FALSE)","v":{"$error":"#N/A"}},{"$f":"VLOOKUP($D54,HQ_Contacts,'HQ and Regional Contacts'!$CA$24,FALSE)","v":{"$error":"#N/A"}},{"$f":"VLOOKUP($D54,HQ_Contacts,'HQ and Regional Contacts'!$CV$24,FALSE)","v":{"$error":"#N/A"}},{"$f":"VLOOKUP($D54,HQ_Contacts,'HQ and Regional Contacts'!$DJ$24,FALSE)","v":{"$error":"#N/A"}},null,null,{"$f":"IF(ISBLANK(BillingSurnames),\"Same Individual\",\"Different Individual\")","v":"Same Individual"},{"$f":"$Z$29","v":""},{"$f":"$AB$29","v":""},{"$f":"$AN$29","v":""},{"$f":"$C$29","v":""},{"$f":"$C$32","v":""},{"$f":"$AF$36","v":""},{"$f":"$AB$32","v":""},{"$f":"$O$32","v":""},{"$f":"$AN$32","v":""},{"$f":"EV54","v":""},null,{"$f":"IF(D54=\"\",\"\",IF(M54=\"Yes\",\"Yes\",\"No\"))","v":""},"No",null,null,null,{"$f":"IF(D54=\"\",\"\",IF(AE54=\"\",\"Report Subscriber: \",\"Indigo Subscriber: \"))","v":""},{"$f":"TEXT($I$42,\"dd-mmm-yyyy\")","v":"00-Jan-1900"},{"$f":"TEXT($CC$47,\"dd-mmm-yyyy\")&\";\"","v":"30-Dec-1900;"},{"$f":"IF('Order Form'!$L$101=\"NGO\",\"\",\" (CDO Pricing); \")","v":" (CDO Pricing); "},{"$f":"IF(Z54=\"X\",\"MS Add-on;\",\"\")","v":""},{"$f":"IF(AK54=\"\",\"\",\"Custom Cut (\"&AK54&\");\")","v":""},{"$f":"IF(#REF!=\"\",\"\",\"Subsector: \"&#REF!&\";\")","v":{"$error":"#REF!"}},{"$f":"IF(EH54=\"Yes\",\"\",\"No data to provide;\")","v":"No data to provide;"},null,{"$f":"IF(EM54=\"\",\"\",EM54&EN54&\" - \"&EO54&EP54&EQ54&ER54&ES54&ET54)","v":""}]
[null,null,{"$f":"C54+1","v":2},null,null,null,null,null,null,null,null,null,null,null,null,null,null,"",null,null,null,null,null,null,null,null,null,null,null,{"$f":"IF(AND(Z55=\"x\",R55=\"NGOLP & Multisector\"),1,0)","v":0},null,null,null,null,null,null,null,null,null,null,null,null,null,null,null,null,null,null,null,null,null,null,null,"",null,null,null,null,null,null,null,null,null,null,0,0,{"$f":"IF(ISBLANK(D55),\"\",D55)","v":""},"",0,{"$error":"#N/A"},"",0,null,null,"",{"$f":"IF(BA55=\"Yes\",450,\"\")","v":""},{"$f":"SUM(BW55,BP55,BT55,BV55,BQ55,BR55,BX55)","v":{"$error":"#N/A"}},null,null,null,null,null,null,null,null,{"$f":"TODAY()","v":"2021-03-18"},{"$f":"$Z$17","v":""},{"$f":"$AB$17","v":""},{"$f":"$AN$17","v":""},{"$f":"$C$17","v":""},{"$f":"$C$20","v":""},{"$f":"$AF$24","v":""},{"$f":"$AB$20","v":""},{"$f":"$O$20","v":""},{"$f":"$AN$20","v":""},{"$f":"TotalIndigo","v":0},{"$f":"D55","v":0},{"$f":"VLOOKUP($CS55,SurveyDataContacts,'Survey Contacts'!$L$24,FALSE)","v":{"$error":"#N/A"}},{"$f":"VLOOKUP($CS55,SurveyDataContacts,'Survey Contacts'!$T$24,FALSE)","v":{"$error":"#N/A"}},{"$f":"VLOOKUP($CS55,SurveyDataContacts,'Survey Contacts'!$AL$24,FALSE)","v":{"$error":"#N/A"}},{"$f":"CL55","v":""},{"$f":"VLOOKUP($CS55,SurveyDataContacts,'Survey Contacts'!$BD$24,FALSE)","v":{"$error":"#N/A"}},{"$f":"VLOOKUP($CS55,SurveyDataContacts,'Survey Contacts'!$DS$24,FALSE)","v":{"$error":"#N/A"}},{"$f":"VLOOKUP($CS55,SurveyDataContacts,'Survey Contacts'!$BV$24,FALSE)","v":{"$error":"#N/A"}},{"$f":"VLOOKUP($CS55,SurveyDataContacts,'Survey Contacts'!$CQ$24,FALSE)","v":{"$error":"#N/A"}},{"$f":"VLOOKUP($CS55,SurveyDataContacts,'Survey Contacts'!$DE$24,FALSE)","v":{"$error":"#N/A"}},{"$f":"VLOOKUP($CS55,CountryInformation_Ad_Hoc,$N$150,FALSE)","v":{"$error":"#N/A"}},{"$f":"IF(DC55<16,\"15 or Less\",\"More than 15\")","v":{"$error":"#N/A"}},{"$f":"VLOOKUP($CS55,CountryInformation_Ad_Hoc,$W$150,FALSE)","v":{"$error":"#N/A"}},{"$f":"VLOOKUP($CS55,CountryInformation_Ad_Hoc,$AF$150,FALSE)","v":{"$error":"#N/A"}},{"$f":"YEAR($I$42)","v":1900},{"$f":"CS55&\" - \"&DG55","v":"0 - 1900"},null,{"$f":"CW55&CS55&DG55","v":"01900"},{"$f":"VLOOKUP($D55,HQ_Contacts,'HQ and Regional Contacts'!$Q$24,FALSE)","v":{"$error":"#N/A"}},{"$f":"VLOOKUP($D55,HQ_Contacts,'HQ and Regional Contacts'!$Y$24,FALSE)","v":{"$error":"#N/A"}},{"$f":"VLOOKUP($D55,HQ_Contacts,'HQ and Regional Contacts'!$AQ$24,FALSE)","v":{"$error":"#N/A"}},{"$f":"CW55","v":""},{"$f":"VLOOKUP($D55,HQ_Contacts,'HQ and Regional Contacts'!$BI$24,FALSE)","v":{"$error":"#N/A"}},{"$f":"VLOOKUP($D55,HQ_Contacts,'HQ and Regional Contacts'!$DX$24,FALSE)","v":{"$error":"#N/A"}},{"$f":"VLOOKUP($D55,HQ_Contacts,'HQ and Regional Contacts'!$CA$24,FALSE)","v":{"$error":"#N/A"}},{"$f":"VLOOKUP($D55,HQ_Contacts,'HQ and Regional Contacts'!$CV$24,FALSE)","v":{"$error":"#N/A"}},{"$f":"VLOOKUP($D55,HQ_Contacts,'HQ and Regional Contacts'!$DJ$24,FALSE)","v":{"$error":"#N/A"}},null,null,{"$f":"IF(ISBLANK(BillingSurnames),\"Same Individual\",\"Different Individual\")","v":"Same Individual"},{"$f":"$Z$29","v":""},{"$f":"$AB$29","v":""},{"$f":"$AN$29","v":""},{"$f":"$C$29","v":""},{"$f":"$C$32","v":""},{"$f":"$AF$36","v":""},{"$f":"$AB$32","v":""},{"$f":"$O$32","v":""},{"$f":"$AN$32","v":""},{"$f":"EV55","v":""},null,{"$f":"IF(D55=\"\",\"\",IF(M55=\"Yes\",\"Yes\",\"No\"))","v":""},"No",null,null,null,{"$f":"IF(D55=\"\",\"\",IF(AE55=\"\",\"Report Subscriber: \",\"Indigo Subscriber: \"))","v":""},{"$f":"TEXT($I$42,\"dd-mmm-yyyy\")","v":"00-Jan-1900"},{"$f":"TEXT($CC$47,\"dd-mmm-yyyy\")&\";\"","v":"30-Dec-1900;"},{"$f":"IF('Order Form'!$L$101=\"NGO\",\"\",\" (CDO Pricing); \")","v":" (CDO Pricing); "},{"$f":"IF(Z55=\"X\",\"MS Add-on;\",\"\")","v":""},{"$f":"IF(AK55=\"\",\"\",\"Custom Cut (\"&AK55&\");\")","v":""},{"$f":"IF(#REF!=\"\",\"\",\"Subsector: \"&#REF!&\";\")","v":{"$error":"#REF!"}},{"$f":"IF(EH55=\"Yes\",\"\",\"No data to provide;\")","v":"No data to provide;"},null,{"$f":"IF(EM55=\"\",\"\",EM55&EN55&\" - \"&EO55&EP55&EQ55&ER55&ES55&ET55)","v":""}]
[null,null,{"$f":"C55+1","v":3},null,null,null,null,null,null,null,null,null,null,null,null,null,null,"",null,null,null,null,null,null,null,null,null,null,null,0,null,null,null,null,null,null,null,null,null,null,null,null,null,null,null,null,null,null,null,null,null,null,null,"",null,null,null,null,null,null,null,null,null,null,0,0,"","",0,{"$error":"#N/A"},"",0,null,null,"","",{"$error":"#N/A"},null,null,null,null,null,null,null,null,"2021-03-18","","","","","","","","","",{"$f":"TotalIndigo","v":0},{"$f":"D56","v":0},{"$f":"VLOOKUP($CS56,SurveyDataContacts,'Survey Contacts'!$L$24,FALSE)","v":{"$error":"#N/A"}},{"$f":"VLOOKUP($CS56,SurveyDataContacts,'Survey Contacts'!$T$24,FALSE)","v":{"$error":"#N/A"}},{"$f":"VLOOKUP($CS56,SurveyDataContacts,'Survey Contacts'!$AL$24,FALSE)","v":{"$error":"#N/A"}},"",{"$f":"VLOOKUP($CS56,SurveyDataContacts,'Survey Contacts'!$BD$24,FALSE)","v":{"$error":"#N/A"}},{"$f":"VLOOKUP($CS56,SurveyDataContacts,'Survey Contacts'!$DS$24,FALSE)","v":{"$error":"#N/A"}},{"$f":"VLOOKUP($CS56,SurveyDataContacts,'Survey Contacts'!$BV$24,FALSE)","v":{"$error":"#N/A"}},{"$f":"VLOOKUP($CS56,SurveyDataContacts,'Survey Contacts'!$CQ$24,FALSE)","v":{"$error":"#N/A"}},{"$f":"VLOOKUP($CS56,SurveyDataContacts,'Survey Contacts'!$DE$24,FALSE)","v":{"$error":"#N/A"}},{"$f":"VLOOKUP($CS56,CountryInformation_Ad_Hoc,$N$150,FALSE)","v":{"$error":"#N/A"}},{"$error":"#N/A"},{"$f":"VLOOKUP($CS56,CountryInformation_Ad_Hoc,$W$150,FALSE)","v":{"$error":"#N/A"}},{"$f":"VLOOKUP($CS56,CountryInformation_Ad_Hoc,$AF$150,FALSE)","v":{"$error":"#N/A"}},1900,"0 - 1900",null,"01900",{"$f":"VLOOKUP($D56,HQ_Contacts,'HQ and Regional Contacts'!$Q$24,FALSE)","v":{"$error":"#N/A"}},{"$f":"VLOOKUP($D56,HQ_Contacts,'HQ and Regional Contacts'!$Y$24,FALSE)","v":{"$error":"#N/A"}},{"$f":"VLOOKUP($D56,HQ_Contacts,'HQ and Regional Contacts'!$AQ$24,FALSE)","v":{"$error":"#N/A"}},"",{"$f":"VLOOKUP($D56,HQ_Contacts,'HQ and Regional Contacts'!$BI$24,FALSE)","v":{"$error":"#N/A"}},{"$f":"VLOOKUP($D56,HQ_Contacts,'HQ and Regional Contacts'!$DX$24,FALSE)","v":{"$error":"#N/A"}},{"$f":"VLOOKUP($D56,HQ_Contacts,'HQ and Regional Contacts'!$CA$24,FALSE)","v":{"$error":"#N/A"}},{"$f":"VLOOKUP($D56,HQ_Contacts,'HQ and Regional Contacts'!$CV$24,FALSE)","v":{"$error":"#N/A"}},{"$f":"VLOOKUP($D56,HQ_Contacts,'HQ and Regional Contacts'!$DJ$24,FALSE)","v":{"$error":"#N/A"}},null,null,{"$f":"IF(ISBLANK(BillingSurnames),\"Same Individual\",\"Different Individual\")","v":"Same Individual"},"","","","","","","","","","",null,{"$f":"IF(D56=\"\",\"\",IF(M56=\"Yes\",\"Yes\",\"No\"))","v":""},"No",null,null,null,{"$f":"IF(D56=\"\",\"\",IF(AE56=\"\",\"Report Subscriber: \",\"Indigo Subscriber: \"))","v":""},"00-Jan-1900",{"$f":"TEXT($CC$47,\"dd-mmm-yyyy\")&\";\"","v":"30-Dec-1900;"},{"$f":"IF('Order Form'!$L$101=\"NGO\",\"\",\" (CDO Pricing); \")","v":" (CDO Pricing); "},{"$f":"IF(Z56=\"X\",\"MS Add-on;\",\"\")","v":""},{"$f":"IF(AK56=\"\",\"\",\"Custom Cut (\"&AK56&\");\")","v":""},{"$f":"IF(#REF!=\"\",\"\",\"Subsector: \"&#REF!&\";\")","v":{"$error":"#REF!"}},"No data to provide;",null,""]
[null,null,4,null,null,null,null,null,null,null,null,null,null,null,null,null,null,"",null,null,null,null,null,null,null,null,null,null,null,0,null,null,null,null,null,null,null,null,null,null,null,null,null,null,null,null,null,null,null,null,null,null,null,"",null,null,null,null,null,null,null,null,null,null,0,0,"","",0,{"$error":"#N/A"},"",0,null,null,"","",{"$error":"#N/A"}]
[null,null,5,null,null,null,null,null,null,null,null,null,null,null,null,null,null,"",null,null,null,null,null,null,null,null,null,null,null,0,null,null,null,null,null,null,null,null,null,null,null,null,null,null,null,null,null,null,null,null,null,null,null,"",null,null,null,null,null,null,null,null,null,null,0,0,"","",0,{"$error":"#N/A"},"",0,null,null,"","",{"$error":"#N/A"}]
[null,null,6,null,null,null,null,null,null,null,null,null,null,null,null,null,null,"",null,null,null,null,null,null,null,null,null,null,null,0,null,null,null,null,null,null,null,null,null,null,null,null,null,null,null,null,null,null,null,null,null,null,null,"",null,null,null,null,null,null,null,null,null,null,0,0,"","",0,{"$error":"#N/A"},"",0,null,null,"","",{"$error":"#N/A"}]
[null,null,7,null,null,null,null,null,null,null,null,null,null,null,null,null,null,"",null,null,null,null,null,null,null,null,null,null,null,0,null,null,null,null,null,null,null,null,null,null,null,null,null,null,null,null,null,null,null,null,null,null,null,"",null,null,null,null,null,null,null,null,null,null,0,0,"","",0,{"$error":"#N/A"},"",0,null,null,"","",{"$error":"#N/A"}]
[null,null,8,null,null,null,null,null,null,null,null,null,null,null,null,null,null,"",null,null,null,null,null,null,null,null,null,null,null,0,null,null,null,null,null,null,null,null,null,null,null,null,null,null,null,null,null,null,null,null,null,null,null,"",null,null,null,null,null,null,null,null,null,null,0,0,"","",0,{"$error":"#N/A"},"",0,null,null,"","",{"$error":"#N/A"}]
[null,null,9,null,null,null,null,null,null,null,null,null,null,null,null,null,null,"",null,null,null,null,null,null,null,null,null,null,null,0,null,null,null,null,null,null,null,null,null,null,null,null,null,null,null,null,null,null,null,null,null,null,null,"",null,null,null,null,null,null,null,null,null,null,0,0,"","",0,{"$error":"#N/A"},"",0,null,null,"","",{"$error":"#N/A"}]
[null,null,10,null,null,null,null,null,null,null,null,null,null,null,null,null,null,"",null,null,null,null,null,null,null,null,null,null,null,0,null,null,null,null,null,null,null,null,null,null,null,null,null,null,null,null,null,null,null,null,null,null,null,"",null,null,null,null,null,null,null,null,null,null,0,0,"","",0,{"$error":"#N/A"},"",0,null,null,"","",{"$error":"#N/A"}]
[null,null,11,null,null,null,null,null,null,null,null,null,null,null,null,null,null,"",null,null,null,null,null,null,null,null,null,null,null,0,null,null,null,null,null,null,null,null,null,null,null,null,null,null,null,null,null,null,null,null,null,null,null,"",null,null,null,null,null,null,null,null,null,null,0,0,"","",0,{"$error":"#N/A"},"",0,null,null,"","",{"$error":"#N/A"}]
[null,null,12,null,null,null,null,null,null,null,null,null,null,null,null,null,null,"",null,null,null,null,null,null,null,null,null,null,null,0,null,null,null,null,null,null,null,null,null,null,null,null,null,null,null,null,null,null,null,null,null,null,null,"",null,null,null,null,null,null,null,null,null,null,0,0,"","",0,{"$error":"#N/A"},"",0,null,null,"","",{"$error":"#N/A"}]
[null,null,13,null,null,null,null,null,null,null,null,null,null,null,null,null,null,"",null,null,null,null,null,null,null,null,null,null,null,0,null,null,null,null,null,null,null,null,null,null,null,null,null,null,null,null,null,null,null,null,null,null,null,"",null,null,null,null,null,null,null,null,null,null,0,0,"","",0,{"$error":"#N/A"},"",0,null,null,"","",{"$error":"#N/A"}]
[null,null,14,null,null,null,null,null,null,null,null,null,null,null,null,null,null,"",null,null,null,null,null,null,null,null,null,null,null,0,null,null,null,null,null,null,null,null,null,null,null,null,null,null,null,null,null,null,null,null,null,null,null,"",null,null,null,null,null,null,null,null,null,null,0,0,"","",0,{"$error":"#N/A"},"",0,null,null,"","",{"$error":"#N/A"}]
[null,null,15,null,null,null,null,null,null,null,null,null,null,null,null,null,null,"",null,null,null,null,null,null,null,null,null,null,null,0,null,null,null,null,null,null,null,null,null,null,null,null,null,null,null,null,null,null,null,null,null,null,null,"",null,null,null,null,null,null,null,null,null,null,0,0,"","",0,{"$error":"#N/A"},"",0,null,null,"","",{"$error":"#N/A"}]
[null,null,16,null,null,null,null,null,null,null,null,null,null,null,null,null,null,"",null,null,null,null,null,null,null,null,null,null,null,0,null,null,null,null,null,null,null,null,null,null,null,null,null,null,null,null,null,null,null,null,null,null,null,"",null,null,null,null,null,null,null,null,null,null,0,0,"","",0,{"$error":"#N/A"},"",0,null,null,"","",{"$error":"#N/A"}]
[null,null,17,null,null,null,null,null,null,null,null,null,null,null,null,null,null,"",null,null,null,null,null,null,null,null,null,null,null,0,null,null,null,null,null,null,null,null,null,null,null,null,null,null,null,null,null,null,null,null,null,null,null,"",null,null,null,null,null,null,null,null,null,null,0,0,"","",0,{"$error":"#N/A"},"",0,null,null,"","",{"$error":"#N/A"}]
[null,null,18,null,null,null,null,null,null,null,null,null,null,null,null,null,null,"",null,null,null,null,null,null,null,null,null,null,null,0,null,null,null,null,null,null,null,null,null,null,null,null,null,null,null,null,null,null,null,null,null,null,null,"",null,null,null,null,null,null,null,null,null,null,0,0,"","",0,{"$error":"#N/A"},"",0,null,null,"","",{"$error":"#N/A"}]
[null,null,19,null,null,null,null,null,null,null,null,null,null,null,null,null,null,"",null,null,null,null,null,null,null,null,null,null,null,0,null,null,null,null,null,null,null,null,null,null,null,null,null,null,null,null,null,null,null,null,null,null,null,"",null,null,null,null,null,null,null,null,null,null,0,0,"","",0,{"$error":"#N/A"},"",0,null,null,"","",{"$error":"#N/A"}]
[null,null,20,null,null,null,null,null,null,null,null,null,null,null,null,null,null,"",null,null,null,null,null,null,null,null,null,null,null,0,null,null,null,null,null,null,null,null,null,null,null,null,null,null,null,null,null,null,null,null,null,null,null,"",null,null,null,null,null,null,null,null,null,null,0,0,"","",0,{"$error":"#N/A"},"",0,null,null,"","",{"$error":"#N/A"}]
[null,null,21,null,null,null,null,null,null,null,null,null,null,null,null,null,null,"",null,null,null,null,null,null,null,null,null,null,null,0,null,null,null,null,null,null,null,null,null,null,null,null,null,null,null,null,null,null,null,null,null,null,null,"",null,null,null,null,null,null,null,null,null,null,0,0,"","",0,{"$error":"#N/A"},"",0,null,null,"","",{"$error":"#N/A"}]
[null,null,22,null,null,null,null,null,null,null,null,null,null,null,null,null,null,"",null,null,null,null,null,null,null,null,null,null,null,0,null,null,null,null,null,null,null,null,null,null,null,null,null,null,null,null,null,null,null,null,null,null,null,"",null,null,null,null,null,null,null,null,null,null,0,0,"","",0,{"$error":"#N/A"},"",0,null,null,"","",{"$error":"#N/A"}]
[null,null,23,null,null,null,null,null,null,null,null,null,null,null,null,null,null,"",null,null,null,null,null,null,null,null,null,null,null,0,null,null,null,null,null,null,null,null,null,null,null,null,null,null,null,null,null,null,null,null,null,null,null,"",null,null,null,null,null,null,null,null,null,null,0,0,"","",0,{"$error":"#N/A"},"",0,null,null,"","",{"$error":"#N/A"}]
[null,null,24,null,null,null,null,null,null,null,null,null,null,null,null,null,null,"",null,null,null,null,null,null,null,null,null,null,null,0,null,null,null,null,null,null,null,null,null,null,null,null,null,null,null,null,null,null,null,null,null,null,null,"",null,null,null,null,null,null,null,null,null,null,0,0,"","",0,{"$error":"#N/A"},"",0,null,null,"","",{"$error":"#N/A"}]
[null,null,25,null,null,null,null,null,null,null,null,null,null,null,null,null,null,"",null,null,null,null,null,null,null,null,null,null,null,0,null,null,null,null,null,null,null,null,null,null,null,null,null,null,null,null,null,null,null,null,null,null,null,"",null,null,null,null,null,null,null,null,null,null,0,0,"","",0,{"$error":"#N/A"},"",0,null,null,"","",{"$error":"#N/A"}]
[null,null,26,null,null,null,null,null,null,null,null,null,null,null,null,null,null,"",null,null,null,null,null,null,null,null,null,null,null,0,null,null,null,null,null,null,null,null,null,null,null,null,null,null,null,null,null,null,null,null,null,null,null,"",null,null,null,null,null,null,null,null,null,null,0,0,"","",0,{"$error":"#N/A"},"",0,null,null,"","",{"$error":"#N/A"}]
[null,null,27,null,null,null,null,null,null,null,null,null,null,null,null,null,null,"",null,null,null,null,null,null,null,null,null,null,null,0,null,null,null,null,null,null,null,null,null,null,null,null,null,null,null,null,null,null,null,null,null,null,null,"",null,null,null,null,null,null,null,null,null,null,0,0,"","",0,{"$error":"#N/A"},"",0,null,null,"","",{"$error":"#N/A"}]
[null,null,28,null,null,null,null,null,null,null,null,null,null,null,null,null,null,"",null,null,null,null,null,null,null,null,null,null,null,0,null,null,null,null,null,null,null,null,null,null,null,null,null,null,null,null,null,null,null,null,null,null,null,"",null,null,null,null,null,null,null,null,null,null,0,0,"","",0,{"$error":"#N/A"},"",0,null,null,"","",{"$error":"#N/A"}]
[null,null,29,null,null,null,null,null,null,null,null,null,null,null,null,null,null,"",null,null,null,null,null,null,null,null,null,null,null,0,null,null,null,null,null,null,null,null,null,null,null,null,null,null,null,null,null,null,null,null,null,null,null,"",null,null,null,null,null,null,null,null,null,null,0,0,"","",0,{"$error":"#N/A"},"",0,null,null,"","",{"$error":"#N/A"}]
[null,null,30,null,null,null,null,null,null,null,null,null,null,null,null,null,null,"",null,null,null,null,null,null,null,null,null,null,null,0,null,null,null,null,null,null,null,null,null,null,null,null,null,null,null,null,null,null,null,null,null,null,null,"",null,null,null,null,null,null,null,null,null,null,0,0,"","",0,{"$error":"#N/A"},"",0,null,null,"","",{"$error":"#N/A"}]
[null,null,31,null,null,null,null,null,null,null,null,null,null,null,null,null,null,"",null,null,null,null,null,null,null,null,null,null,null,0,null,null,null,null,null,null,null,null,null,null,null,null,null,null,null,null,null,null,null,null,null,null,null,"",null,null,null,null,null,null,null,null,null,null,0,0,"","",0,{"$error":"#N/A"},"",0,null,null,"","",{"$error":"#N/A"}]
[null,null,32,null,null,null,null,null,null,null,null,null,null,null,null,null,null,"",null,null,null,null,null,null,null,null,null,null,null,0,null,null,null,null,null,null,null,null,null,null,null,null,null,null,null,null,null,null,null,null,null,null,null,"",null,null,null,null,null,null,null,null,null,null,0,0,"","",0,{"$error":"#N/A"},"",0,null,null,"","",{"$error":"#N/A"}]
[null,null,33,null,null,null,null,null,null,null,null,null,null,null,null,null,null,"",null,null,null,null,null,null,null,null,null,null,null,0,null,null,null,null,null,null,null,null,null,null,null,null,null,null,null,null,null,null,null,null,null,null,null,{"$f":"IFERROR(ROUND(IF(ISBLANK(D86),\"\",IF(M86=\"Yes\",0,NGOLPSurvey*0.5)),0),\"\")","v":""},null,null,null,null,null,null,null,null,null,null,0,0,"",{"$f":"IF(ISBLANK(D86),\"\",NGOLPSurvey)","v":""},{"$f":"IF(ISBLANK(AE86),0,Indigo)","v":0},{"$f":"AD86*MSAddOn","v":{"$error":"#N/A"}},{"$f":"IF(ISBLANK(AK86),\"\",AK86)","v":""},{"$f":"IF(AK86=\"All Cycles\",CustomAll,0)+IF(OR(AK86=\"Cycle 1 (Apr)\", AK86=\"Cycle 2 (Jul)\", AK86=\"Cycle 3 (Oct)\"),Custom,0)","v":0},null,null,{"$f":"IF(M86=\"Yes\",\"\",BB86)","v":""},"",{"$error":"#N/A"}]
[null,null,34,null,null,null,null,null,null,null,null,null,null,null,null,null,null,"",null,null,null,null,null,null,null,null,null,null,null,0,null,null,null,null,null,null,null,null,null,null,null,null,null,null,null,null,null,null,null,null,null,null,null,"",null,null,null,null,null,null,null,null,null,null,0,0,"","",0,{"$error":"#N/A"},"",0,null,null,"","",{"$error":"#N/A"}]
[null,null,35,null,null,null,null,null,null,null,null,null,null,null,null,null,null,"",null,null,null,null,null,null,null,null,null,null,null,0,null,null,null,null,null,null,null,null,null,null,null,null,null,null,null,null,null,null,null,null,null,null,null,"",null,null,null,null,null,null,null,null,null,null,0,0,"","",0,{"$error":"#N/A"},"",0,null,null,"","",{"$error":"#N/A"}]
[null,null,36,null,null,null,null,null,null,null,null,null,null,null,null,null,null,"",null,null,null,null,null,null,null,null,null,null,null,0,null,null,null,null,null,null,null,null,null,null,null,null,null,null,null,null,null,null,null,null,null,null,null,"",null,null,null,null,null,null,null,null,null,null,0,0,"","",0,{"$error":"#N/A"},"",0,null,null,"","",{"$error":"#N/A"}]
[null,null,37,null,null,null,null,null,null,null,null,null,null,null,null,null,null,"",null,null,null,null,null,null,null,null,null,null,null,0,null,null,null,null,null,null,null,null,null,null,null,null,null,null,null,null,null,null,null,null,null,null,null,"",null,null,null,null,null,null,null,null,null,null,0,0,"","",0,{"$error":"#N/A"},"",0,null,null,"","",{"$error":"#N/A"}]
[null,null,38,null,null,null,null,null,null,null,null,null,null,null,null,null,null,"",null,null,null,null,null,null,null,null,null,null,null,0,null,null,null,null,null,null,null,null,null,null,null,null,null,null,null,null,null,null,null,null,null,null,null,"",null,null,null,null,null,null,null,null,null,null,0,0,"","",0,{"$error":"#N/A"},"",0,null,null,"","",{"$error":"#N/A"}]
[null,null,39,null,null,null,null,null,null,null,null,null,null,null,null,null,null,"",null,null,null,null,null,null,null,null,null,null,null,0,null,null,null,null,null,null,null,null,null,null,null,null,null,null,null,null,null,null,null,null,null,null,null,"",null,null,null,null,null,null,null,null,null,null,0,0,"","",0,{"$error":"#N/A"},"",0,null,null,"","",{"$error":"#N/A"}]
[null,null,40,null,null,null,null,null,null,null,null,null,null,null,null,null,null,"",null,null,null,null,null,null,null,null,null,null,null,0,null,null,null,null,null,null,null,null,null,null,null,null,null,null,null,null,null,null,null,null,null,null,null,"",null,null,null,null,null,null,null,null,null,null,0,0,"","",0,{"$error":"#N/A"},"",0,null,null,"","",{"$error":"#N/A"}]
[null,null,41,null,null,null,null,null,null,null,null,null,null,null,null,null,null,"",null,null,null,null,null,null,null,null,null,null,null,0,null,null,null,null,null,null,null,null,null,null,null,null,null,null,null,null,null,null,null,null,null,null,null,"",null,null,null,null,null,null,null,null,null,null,0,0,"","",0,{"$error":"#N/A"},"",0,null,null,"","",{"$error":"#N/A"}]
[null,null,42,null,null,null,null,null,null,null,null,null,null,null,null,null,null,"",null,null,null,null,null,null,null,null,null,null,null,0,null,null,null,null,null,null,null,null,null,null,null,null,null,null,null,null,null,null,null,null,null,null,null,"",null,null,null,null,null,null,null,null,null,null,0,0,"","",0,{"$error":"#N/A"},"",0,null,null,"","",{"$error":"#N/A"}]
[null,null,43,null,null,null,null,null,null,null,null,null,null,null,null,null,null,"",null,null,null,null,null,null,null,null,null,null,null,0,null,null,null,null,null,null,null,null,null,null,null,null,null,null,null,null,null,null,null,null,null,null,null,"",null,null,null,null,null,null,null,null,null,null,0,0,"","",0,{"$error":"#N/A"},"",0,null,null,"","",{"$error":"#N/A"}]
[null,null,44,null,null,null,null,null,null,null,null,null,null,null,null,null,null,"",null,null,null,null,null,null,null,null,null,null,null,0,null,null,null,null,null,null,null,null,null,null,null,null,null,null,null,null,null,null,null,null,null,null,null,"",null,null,null,null,null,null,null,null,null,null,0,0,"","",0,{"$error":"#N/A"},"",0,null,null,"","",{"$error":"#N/A"}]
[null,null,45,null,null,null,null,null,null,null,null,null,null,null,null,null,null,"",null,null,null,null,null,null,null,null,null,null,null,0,null,null,null,null,null,null,null,null,null,null,null,null,null,null,null,null,null,null,null,null,null,null,null,"",null,null,null,null,null,null,null,null,null,null,0,0,"","",0,{"$error":"#N/A"},"",0,null,null,"","",{"$error":"#N/A"}]
[null,null,46,null,null,null,null,null,null,null,null,null,null,null,null,null,null,"",null,null,null,null,null,null,null,null,null,null,null,0,null,null,null,null,null,null,null,null,null,null,null,null,null,null,null,null,null,null,null,null,null,null,null,"",null,null,null,null,null,null,null,null,null,null,0,0,"","",0,{"$error":"#N/A"},"",0,null,null,"","",{"$error":"#N/A"}]
[null,null,47,null,null,null,null,null,null,null,null,null,null,null,null,null,null,"",null,null,null,null,null,null,null,null,null,null,null,0,null,null,null,null,null,null,null,null,null,null,null,null,null,null,null,null,null,null,null,null,null,null,null,"",null,null,null,null,null,null,null,null,null,null,0,0,"","",0,{"$error":"#N/A"},"",0,null,null,"","",{"$error":"#N/A"}]
[null,null,48,null,null,null,null,null,null,null,null,null,null,null,null,null,null,"",null,null,null,null,null,null,null,null,null,null,null,0,null,null,null,null,null,null,null,null,null,null,null,null,null,null,null,null,null,null,null,null,null,null,null,"",null,null,null,null,null,null,null,null,null,null,0,0,"","",0,{"$error":"#N/A"},"",0,null,null,"","",{"$error":"#N/A"}]
[null,null,49,null,null,null,null,null,null,null,null,null,null,null,null,null,null,"",null,null,null,null,null,null,null,null,null,null,null,0,null,null,null,null,null,null,null,null,null,null,null,null,null,null,null,null,null,null,null,null,null,null,null,"",null,null,null,null,null,null,null,null,null,null,0,0,"","",0,{"$error":"#N/A"},"",0,null,null,"","",{"$error":"#N/A"}]
[null,null,50,null,null,null,null,null,null,null,null,null,null,null,null,null,null,"",null,null,null,null,null,null,null,null,null,null,null,0,null,null,null,null,null,null,null,null,null,null,null,null,null,null,null,null,null,null,null,null,null,null,null,"",null,null,null,null,null,null,null,null,null,null,0,0,"","",0,{"$error":"#N/A"},"",0,null,null,"","",{"$error":"#N/A"}]
[null,null,51,null,null,null,null,null,null,null,null,null,null,null,null,null,null,"",null,null,null,null,null,null,null,null,null,null,null,0,null,null,null,null,null,null,null,null,null,null,null,null,null,null,null,null,null,null,null,null,null,null,null,"",null,null,null,null,null,null,null,null,null,null,0,0,"","",0,{"$error":"#N/A"},"",0,null,null,"","",{"$error":"#N/A"}]
[null,null,52,null,null,null,null,null,null,null,null,null,null,null,null,null,null,"",null,null,null,null,null,null,null,null,null,null,null,0,null,null,null,null,null,null,null,null,null,null,null,null,null,null,null,null,null,null,null,null,null,null,null,"",null,null,null,null,null,null,null,null,null,null,0,0,"","",0,{"$error":"#N/A"},"",0,null,null,"","",{"$error":"#N/A"}]
[null,null,53,null,null,null,null,null,null,null,null,null,null,null,null,null,null,"",null,null,null,null,null,null,null,null,null,null,null,0,null,null,null,null,null,null,null,null,null,null,null,null,null,null,null,null,null,null,null,null,null,null,null,"",null,null,null,null,null,null,null,null,null,null,0,0,"","",0,{"$error":"#N/A"},"",0,null,null,"","",{"$error":"#N/A"}]
[null,null,54,null,null,null,null,null,null,null,null,null,null,null,null,null,null,"",null,null,null,null,null,null,null,null,null,null,null,0,null,null,null,null,null,null,null,null,null,null,null,null,null,null,null,null,null,null,null,null,null,null,null,"",null,null,null,null,null,null,null,null,null,null,0,0,"","",0,{"$error":"#N/A"},"",0,null,null,"","",{"$error":"#N/A"}]
[null,null,55,null,null,null,null,null,null,null,null,null,null,null,null,null,null,"",null,null,null,null,null,null,null,null,null,null,null,0,null,null,null,null,null,null,null,null,null,null,null,null,null,null,null,null,null,null,null,null,null,null,null,"",null,null,null,null,null,null,null,null,null,null,0,0,"","",0,{"$error":"#N/A"},"",0,null,null,"","",{"$error":"#N/A"}]
[null,null,56,null,null,null,null,null,null,null,null,null,null,null,null,null,null,"",null,null,null,null,null,null,null,null,null,null,null,0,null,null,null,null,null,null,null,null,null,null,null,null,null,null,null,null,null,null,null,null,null,null,null,"",null,null,null,null,null,null,null,null,null,null,0,0,"","",0,{"$error":"#N/A"},"",0,null,null,"","",{"$error":"#N/A"}]
[null,null,57,null,null,null,null,null,null,null,null,null,null,null,null,null,null,"",null,null,null,null,null,null,null,null,null,null,null,0,null,null,null,null,null,null,null,null,null,null,null,null,null,null,null,null,null,null,null,null,null,null,null,"",null,null,null,null,null,null,null,null,null,null,0,0,"","",0,{"$error":"#N/A"},"",0,null,null,"","",{"$error":"#N/A"}]
[null,null,58,null,null,null,null,null,null,null,null,null,null,null,null,null,null,"",null,null,null,null,null,null,null,null,null,null,null,0,null,null,null,null,null,null,null,null,null,null,null,null,null,null,null,null,null,null,null,null,null,null,null,"",null,null,null,null,null,null,null,null,null,null,0,0,"","",0,{"$error":"#N/A"},"",0,null,null,"","",{"$error":"#N/A"}]
[null,null,59,null,null,null,null,null,null,null,null,null,null,null,null,null,null,"",null,null,null,null,null,null,null,null,null,null,null,0,null,null,null,null,null,null,null,null,null,null,null,null,null,null,null,null,null,null,null,null,null,null,null,"",null,null,null,null,null,null,null,null,null,null,0,0,"","",0,{"$error":"#N/A"},"",0,null,null,"","",{"$error":"#N/A"}]
[null,null,60,null,null,null,null,null,null,null,null,null,null,null,null,null,null,"",null,null,null,null,null,null,null,null,null,null,null,0,null,null,null,null,null,null,null,null,null,null,null,null,null,null,null,null,null,null,null,null,null,null,null,"",null,null,null,null,null,null,null,null,null,null,0,0,"","",0,{"$error":"#N/A"},"",0,null,null,"","",{"$error":"#N/A"}]
[null,null,"GP","NGO Global Pay",null,null,null,null,null,null,null,null,{"$f":"IF(NGOGPChoice=\"No\",\"\",IF(NGOGPChoice=\"Yes (Participant)\", \"Yes\",\"No\"))","v":""},null,null,null,null,null,null,null,null,null,null,null,null,null,null,null,null,null,null,null,null,null,null,null,null,null,null,null,null,null,null,null,{"$f":"IF(NGOGPChoice=\"Yes (Participant)\", NGOGlobalPayFee,IF(NGOGPChoice=\"Yes (Non-Participant)\",NGOGlobalPayFee,\"\"))","v":""},null,null,null,null,null,null,null,null,{"$f":"IF(ISBLANK(M114),0,IF(M114=\"Yes\",0,NGOGlobalPayFee*0.5))","v":0}]
[null,null,null,null,null,null,null,null,null,null,null,null,null,null,null,null,null,null,null,null,null,null,null,null,null,null,null,null,null,null,null,null,null,null,null,null,null,null,null,null,null,null,null,null,null,null,null,null,null,null,null,null,null,null,null,null,null,null,null,null,null,null,null,null,{"$f":"OrgName","v":0},{"$f":"OrderNumber","v":0},{"$f":"TotalIndigo","v":0},{"$f":"SUM(BP54:BP113)","v":0},{"$f":"SUM(BQ54:BQ113)","v":0},{"$f":"SUM(BR54:BR113)","v":{"$error":"#N/A"}},null,{"$f":"SUM(BT54:BT113)","v":0},null,{"$f":"SUM(BV54:BV113)","v":0},{"$f":"SUM(BW54:BW113)","v":0},{"$f":"SUM(BX54:BX113)","v":0},{"$f":"SUM(BY54:BY113)","v":{"$error":"#N/A"}}]
[null,null,null,null,null,null,null,null,null,null,null,null,"Total",null,null,null,null,"NGO Local Pay Surveys",null,null,null,null,null,null,null,"Multsector\nAdd-on",null,null,null,null,"Indigo™ \nAdd-on",null,null,null,null,null,null,null,null,null,null,null,null,null,"NGO Global Pay",null,null,null,null,null,null,null,"Expedited Reports","Non-Particiption Fee"]
[null,null,null,null,null,null,"Total",null,null,null,null,{"$f":"ROUND(SUM(R117:BF117),0)","v":{"$error":"#N/A"}},null,null,null,null,null,{"$f":"NGOLPSurvey*COUNTA(D54:D113)","v":{"$error":"#N/A"}},null,null,null,null,null,null,null,{"$f":"MSAddOn*SUM(AD54:AD113)","v":{"$error":"#N/A"}},null,null,null,null,{"$f":"Indigo*COUNTIF(AE54:AI113,\"=x\")","v":{"$error":"#N/A"}},null,null,null,null,null,null,null,null,null,null,null,null,null,{"$f":"NGOGlobalPayFee","v":0},null,null,null,null,null,null,null,{"$f":"Expedited*COUNTIF(BA54:BA113,\"Yes\")","v":0},{"$f":"SUM(BB54:BF114)","v":0}]
[]
[null,null,null,null,"Note:  All fees are net of tax.  If any  income tax, withholding tax, VAT or similar taxes are payable, the invoice amount will be"]
[null,null,null,null,"increased (grossed-up) and taxes will be withheld from the resulting balance."]
[]
[null,null,null,null,{"$f":"\"Tax rate applicable in \"&IF(AF36=\"\",AF24,AF36)&\":\"","v":"Tax rate applicable in :"},null,null,null,null,null,null,null,null,null,null,null,null,null,null,null,{"$f":"_xlfn.IFNA(VLOOKUP(IF(AF36=\"\",AF24,AF36),GrossUps,2,FALSE)*IF(AB122=\"\",1,0),\"Not Applicable\")","v":"Not Applicable"},null,null,null,null,null,null,null,null,null,"Type X to cancel application of tax"]
[null,null,null,null,"Tax Gross-up Amount:",null,null,null,null,null,null,null,null,null,null,null,null,null,null,null,{"$f":"IF(U122=\"Not Applicable\",0,ROUND((L117/(1-U122))-L117,2))","v":0}]
[]
[]
[]
[null,null,"Subscription Agreement"]
[null,null,"All data is sold via subscription for a 12-month period, beginning on the Subscription Start Date you entered on the first Order Form Page"]
[null,null,"Three survey updates are issued annually, in April, July and October.  Participants must contribute their organization's data once "]
[null,null,"  per year, within 60 days following annual pay review, or be subject to a non-participant surcharge (see Subscription Agreement, paragraph 18)."]
[]
[null,null,"All subscriptions require confirmation of Terms and Conditions via our Subscription Agreement.  "]
[]
[null,null,"Click HERE to review the terms and conditions and confirm your agreement."]
[null,null,null,null,null,null,null,null,null,null,null,null,null,null,null,null,false]
[null,null,{"$f":"IF('Subscription Agreement'!$C$81=TRUE,\"Agreement Confirmed\",\"Agreement NOT Confirmed\")","v":"Agreement NOT Confirmed"}]
[]
[null,null,"Notes / Special Billing Requests"]
[]
[]
[]
[]
[]
[]
[]
[]
[null,null,null,"Country Information"]
[null,null,null,"Please indicate below, for each country in which you registered, the requested information.\nClick on the column header for further help."]
[null,null,null,"When finished, click on Go to Survey Access to continue."]
[null,null,null,null,{"$f":"COLUMN(E150)-4","v":1},null,null,null,null,null,null,null,null,{"$f":"COLUMN(N150)-4","v":10},null,null,null,null,null,null,null,null,{"$f":"COLUMN(W150)-4","v":19},null,null,null,null,null,null,null,null,{"$f":"COLUMN(AF150)-4","v":28}]
[null,null,null,null,null,null,null,null,null,null,null,null,null,null,null,null,null,null,null,null,null,null,null,null,null,null,null,null,null,null,null,"Pay Review Frequency",null,null,null,null,null,null,null,null,"Data Submission Month",null,null,null,null,null,null,null,null,"Data Submission Cycle"]
[null,null,null,null,"Survey Country",null,null,null,null,null,null,null,null,"Total Staff Count",null,null,null,null,null,null,null,null,"Next Pay Review Date"]
[null,null,null,null,null,null,null,null,null,null,null,null,null,null,null,null,null,null,null,null,null,null,null,null,null,null,null,null,null,null,null,null,null,null,null,null,null,null,null,null,null,null,null,null,null,null,null,null,null,{"$f":"IFERROR(VLOOKUP(AO153,DataCycles,2,FALSE),\"\")","v":""}]
[null,null,null,null,null,null,null,null,null,null,null,null,null,null,null,null,null,null,null,null,null,null,null,null,null,null,null,null,null,null,null,null,null,null,null,null,null,null,null,null,null,null,null,null,null,null,null,null,null,""]
[null,null,null,null,null,null,null,null,null,null,null,null,null,null,null,null,null,null,null,null,null,null,null,null,null,null,null,null,null,null,null,null,null,null,null,null,null,null,null,null,null,null,null,null,null,null,null,null,null,""]
[null,null,null,null,null,null,null,null,null,null,null,null,null,null,null,null,null,null,null,null,null,null,null,null,null,null,null,null,null,null,null,null,null,null,null,null,null,null,null,null,null,null,null,null,null,null,null,null,null,""]
[null,null,null,null,null,null,null,null,null,null,null,null,null,null,null,null,null,null,null,null,null,null,null,null,null,null,null,null,null,null,null,null,null,null,null,null,null,null,null,null,null,null,null,null,null,null,null,null,null,""]
[null,null,null,null,null,null,null,null,null,null,null,null,null,null,null,null,null,null,null,null,null,null,null,null,null,null,null,null,null,null,null,null,null,null,null,null,null,null,null,null,null,null,null,null,null,null,null,null,null,""]
[null,null,null,null,null,null,null,null,null,null,null,null,null,null,null,null,null,null,null,null,null,null,null,null,null,null,null,null,null,null,null,null,null,null,null,null,null,null,null,null,null,null,null,null,null,null,null,null,null,""]
[null,null,null,null,null,null,null,null,null,null,null,null,null,null,null,null,null,null,null,null,null,null,null,null,null,null,null,null,null,null,null,null,null,null,null,null,null,null,null,null,null,null,null,null,null,null,null,null,null,""]
[null,null,null,null,null,null,null,null,null,null,null,null,null,null,null,null,null,null,null,null,null,null,null,null,null,null,null,null,null,null,null,null,null,null,null,null,null,null,null,null,null,null,null,null,null,null,null,null,null,""]
[null,null,null,null,null,null,null,null,null,null,null,null,null,null,null,null,null,null,null,null,null,null,null,null,null,null,null,null,null,null,null,null,null,null,null,null,null,null,null,null,null,null,null,null,null,null,null,null,null,""]
[null,null,null,null,null,null,null,null,null,null,null,null,null,null,null,null,null,null,null,null,null,null,null,null,null,null,null,null,null,null,null,null,null,null,null,null,null,null,null,null,null,null,null,null,null,null,null,null,null,""]
[null,null,null,null,null,null,null,null,null,null,null,null,null,null,null,null,null,null,null,null,null,null,null,null,null,null,null,null,null,null,null,null,null,null,null,null,null,null,null,null,null,null,null,null,null,null,null,null,null,""]
[null,null,null,null,null,null,null,null,null,null,null,null,null,null,null,null,null,null,null,null,null,null,null,null,null,null,null,null,null,null,null,null,null,null,null,null,null,null,null,null,null,null,null,null,null,null,null,null,null,""]
[null,null,null,null,null,null,null,null,null,null,null,null,null,null,null,null,null,null,null,null,null,null,null,null,null,null,null,null,null,null,null,null,null,null,null,null,null,null,null,null,null,null,null,null,null,null,null,null,null,""]
[null,null,null,null,null,null,null,null,null,null,null,null,null,null,null,null,null,null,null,null,null,null,null,null,null,null,null,null,null,null,null,null,null,null,null,null,null,null,null,null,null,null,null,null,null,null,null,null,null,""]
[null,null,null,null,null,null,null,null,null,null,null,null,null,null,null,null,null,null,null,null,null,null,null,null,null,null,null,null,null,null,null,null,null,null,null,null,null,null,null,null,null,null,null,null,null,null,null,null,null,""]
[null,null,null,null,null,null,null,null,null,null,null,null,null,null,null,null,null,null,null,null,null,null,null,null,null,null,null,null,null,null,null,null,null,null,null,null,null,null,null,null,null,null,null,null,null,null,null,null,null,""]
[null,null,null,null,null,null,null,null,null,null,null,null,null,null,null,null,null,null,null,null,null,null,null,null,null,null,null,null,null,null,null,null,null,null,null,null,null,null,null,null,null,null,null,null,null,null,null,null,null,""]
[null,null,null,null,null,null,null,null,null,null,null,null,null,null,null,null,null,null,null,null,null,null,null,null,null,null,null,null,null,null,null,null,null,null,null,null,null,null,null,null,null,null,null,null,null,null,null,null,null,""]
[null,null,null,null,null,null,null,null,null,null,null,null,null,null,null,null,null,null,null,null,null,null,null,null,null,null,null,null,null,null,null,null,null,null,null,null,null,null,null,null,null,null,null,null,null,null,null,null,null,""]
[null,null,null,null,null,null,null,null,null,null,null,null,null,null,null,null,null,null,null,null,null,null,null,null,null,null,null,null,null,null,null,null,null,null,null,null,null,null,null,null,null,null,null,null,null,null,null,null,null,""]
[null,null,null,null,null,null,null,null,null,null,null,null,null,null,null,null,null,null,null,null,null,null,null,null,null,null,null,null,null,null,null,null,null,null,null,null,null,null,null,null,null,null,null,null,null,null,null,null,null,""]
[null,null,null,null,null,null,null,null,null,null,null,null,null,null,null,null,null,null,null,null,null,null,null,null,null,null,null,null,null,null,null,null,null,null,null,null,null,null,null,null,null,null,null,null,null,null,null,null,null,""]
[null,null,null,null,null,null,null,null,null,null,null,null,null,null,null,null,null,null,null,null,null,null,null,null,null,null,null,null,null,null,null,null,null,null,null,null,null,null,null,null,null,null,null,null,null,null,null,null,null,""]
[null,null,null,null,null,null,null,null,null,null,null,null,null,null,null,null,null,null,null,null,null,null,null,null,null,null,null,null,null,null,null,null,null,null,null,null,null,null,null,null,null,null,null,null,null,null,null,null,null,""]
[null,null,null,null,null,null,null,null,null,null,null,null,null,null,null,null,null,null,null,null,null,null,null,null,null,null,null,null,null,null,null,null,null,null,null,null,null,null,null,null,null,null,null,null,null,null,null,null,null,""]
[null,null,null,null,null,null,null,null,null,null,null,null,null,null,null,null,null,null,null,null,null,null,null,null,null,null,null,null,null,null,null,null,null,null,null,null,null,null,null,null,null,null,null,null,null,null,null,null,null,""]
[null,null,null,null,null,null,null,null,null,null,null,null,null,null,null,null,null,null,null,null,null,null,null,null,null,null,null,null,null,null,null,null,null,null,null,null,null,null,null,null,null,null,null,null,null,null,null,null,null,""]
[null,null,null,null,null,null,null,null,null,null,null,null,null,null,null,null,null,null,null,null,null,null,null,null,null,null,null,null,null,null,null,null,null,null,null,null,null,null,null,null,null,null,null,null,null,null,null,null,null,""]
[null,null,null,null,null,null,null,null,null,null,null,null,null,null,null,null,null,null,null,null,null,null,null,null,null,null,null,null,null,null,null,null,null,null,null,null,null,null,null,null,null,null,null,null,null,null,null,null,null,""]
[null,null,null,null,null,null,null,null,null,null,null,null,null,null,null,null,null,null,null,null,null,null,null,null,null,null,null,null,null,null,null,null,null,null,null,null,null,null,null,null,null,null,null,null,null,null,null,null,null,""]
[null,null,null,null,null,null,null,null,null,null,null,null,null,null,null,null,null,null,null,null,null,null,null,null,null,null,null,null,null,null,null,null,null,null,null,null,null,null,null,null,null,null,null,null,null,null,null,null,null,""]
[null,null,null,null,null,null,null,null,null,null,null,null,null,null,null,null,null,null,null,null,null,null,null,null,null,null,null,null,null,null,null,null,null,null,null,null,null,null,null,null,null,null,null,null,null,null,null,null,null,{"$f":"IFERROR(VLOOKUP(AO185,DataCycles,2,FALSE),\"\")","v":""}]
[null,null,null,null,null,null,null,null,null,null,null,null,null,null,null,null,null,null,null,null,null,null,null,null,null,null,null,null,null,null,null,null,null,null,null,null,null,null,null,null,null,null,null,null,null,null,null,null,null,""]
[null,null,null,null,null,null,null,null,null,null,null,null,null,null,null,null,null,null,null,null,null,null,null,null,null,null,null,null,null,null,null,null,null,null,null,null,null,null,null,null,null,null,null,null,null,null,null,null,null,""]
[null,null,null,null,null,null,null,null,null,null,null,null,null,null,null,null,null,null,null,null,null,null,null,null,null,null,null,null,null,null,null,null,null,null,null,null,null,null,null,null,null,null,null,null,null,null,null,null,null,""]
[null,null,null,null,null,null,null,null,null,null,null,null,null,null,null,null,null,null,null,null,null,null,null,null,null,null,null,null,null,null,null,null,null,null,null,null,null,null,null,null,null,null,null,null,null,null,null,null,null,""]
[null,null,null,null,null,null,null,null,null,null,null,null,null,null,null,null,null,null,null,null,null,null,null,null,null,null,null,null,null,null,null,null,null,null,null,null,null,null,null,null,null,null,null,null,null,null,null,null,null,""]
[null,null,null,null,null,null,null,null,null,null,null,null,null,null,null,null,null,null,null,null,null,null,null,null,null,null,null,null,null,null,null,null,null,null,null,null,null,null,null,null,null,null,null,null,null,null,null,null,null,""]
[null,null,null,null,null,null,null,null,null,null,null,null,null,null,null,null,null,null,null,null,null,null,null,null,null,null,null,null,null,null,null,null,null,null,null,null,null,null,null,null,null,null,null,null,null,null,null,null,null,""]
[null,null,null,null,null,null,null,null,null,null,null,null,null,null,null,null,null,null,null,null,null,null,null,null,null,null,null,null,null,null,null,null,null,null,null,null,null,null,null,null,null,null,null,null,null,null,null,null,null,""]
[null,null,null,null,null,null,null,null,null,null,null,null,null,null,null,null,null,null,null,null,null,null,null,null,null,null,null,null,null,null,null,null,null,null,null,null,null,null,null,null,null,null,null,null,null,null,null,null,null,""]
[null,null,null,null,null,null,null,null,null,null,null,null,null,null,null,null,null,null,null,null,null,null,null,null,null,null,null,null,null,null,null,null,null,null,null,null,null,null,null,null,null,null,null,null,null,null,null,null,null,""]
[null,null,null,null,null,null,null,null,null,null,null,null,null,null,null,null,null,null,null,null,null,null,null,null,null,null,null,null,null,null,null,null,null,null,null,null,null,null,null,null,null,null,null,null,null,null,null,null,null,""]
[null,null,null,null,null,null,null,null,null,null,null,null,null,null,null,null,null,null,null,null,null,null,null,null,null,null,null,null,null,null,null,null,null,null,null,null,null,null,null,null,null,null,null,null,null,null,null,null,null,""]
[null,null,null,null,null,null,null,null,null,null,null,null,null,null,null,null,null,null,null,null,null,null,null,null,null,null,null,null,null,null,null,null,null,null,null,null,null,null,null,null,null,null,null,null,null,null,null,null,null,""]
[null,null,null,null,null,null,null,null,null,null,null,null,null,null,null,null,null,null,null,null,null,null,null,null,null,null,null,null,null,null,null,null,null,null,null,null,null,null,null,null,null,null,null,null,null,null,null,null,null,""]
[null,null,null,null,null,null,null,null,null,null,null,null,null,null,null,null,null,null,null,null,null,null,null,null,null,null,null,null,null,null,null,null,null,null,null,null,null,null,null,null,null,null,null,null,null,null,null,null,null,""]
[null,null,null,null,null,null,null,null,null,null,null,null,null,null,null,null,null,null,null,null,null,null,null,null,null,null,null,null,null,null,null,null,null,null,null,null,null,null,null,null,null,null,null,null,null,null,null,null,null,""]
[null,null,null,null,null,null,null,null,null,null,null,null,null,null,null,null,null,null,null,null,null,null,null,null,null,null,null,null,null,null,null,null,null,null,null,null,null,null,null,null,null,null,null,null,null,null,null,null,null,""]
[null,null,null,null,null,null,null,null,null,null,null,null,null,null,null,null,null,null,null,null,null,null,null,null,null,null,null,null,null,null,null,null,null,null,null,null,null,null,null,null,null,null,null,null,null,null,null,null,null,""]
[null,null,null,null,null,null,null,null,null,null,null,null,null,null,null,null,null,null,null,null,null,null,null,null,null,null,null,null,null,null,null,null,null,null,null,null,null,null,null,null,null,null,null,null,null,null,null,null,null,""]
[null,null,null,null,null,null,null,null,null,null,null,null,null,null,null,null,null,null,null,null,null,null,null,null,null,null,null,null,null,null,null,null,null,null,null,null,null,null,null,null,null,null,null,null,null,null,null,null,null,""]
[null,null,null,null,null,null,null,null,null,null,null,null,null,null,null,null,null,null,null,null,null,null,null,null,null,null,null,null,null,null,null,null,null,null,null,null,null,null,null,null,null,null,null,null,null,null,null,null,null,""]
[null,null,null,null,null,null,null,null,null,null,null,null,null,null,null,null,null,null,null,null,null,null,null,null,null,null,null,null,null,null,null,null,null,null,null,null,null,null,null,null,null,null,null,null,null,null,null,null,null,""]
[null,null,null,null,null,null,null,null,null,null,null,null,null,null,null,null,null,null,null,null,null,null,null,null,null,null,null,null,null,null,null,null,null,null,null,null,null,null,null,null,null,null,null,null,null,null,null,null,null,""]
[null,null,null,null,null,null,null,null,null,null,null,null,null,null,null,null,null,null,null,null,null,null,null,null,null,null,null,null,null,null,null,null,null,null,null,null,null,null,null,null,null,null,null,null,null,null,null,null,null,""]
[null,null,null,null,null,null,null,null,null,null,null,null,null,null,null,null,null,null,null,null,null,null,null,null,null,null,null,null,null,null,null,null,null,null,null,null,null,null,null,null,null,null,null,null,null,null,null,null,null,""]
[null,null,null,null,null,null,null,null,null,null,null,null,null,null,null,null,null,null,null,null,null,null,null,null,null,null,null,null,null,null,null,null,null,null,null,null,null,null,null,null,null,null,null,null,null,null,null,null,null,""]
[null,null,null,null,null,null,null,null,null,null,null,null,null,null,null,null,null,null,null,null,null,null,null,null,null,null,null,null,null,null,null,null,null,null,null,null,null,null,null,null,null,null,null,null,null,null,null,null,null,""]
[]
[]
[null,null,"RETURN COMPLETED FORM TO REGISTRATION@NGOLOCALPAY.NET"]
[]
[]
[null,null,null,null,"Then, send an email to:",null,null,null,null,null,null,null,null,null,"registration@birchesgroup.com",null,null,null,null,null,null,null,null,null,null,null,null,"and ATTACH THIS FILE to your email."]
[]
[]
[null,null,"© 2013 Birches Group LLC"]

{"sheet":"Order Form (Ad-Hoc CDO)","index":7,"n_rows":221,"n_cols":152,"rows_kept":221,"cut":false,"hidden":false,"merged":[[214,2,214,57],[217,14,217,25],[51,25,51,29],[53,25,53,29],[54,25,54,29],[55,25,55,29],[56,25,56,29],[57,25,57,29],[58,25,58,29],[59,25,59,29],[211,4,211,12],[211,13,211,21],[211,22,211,30],[211,31,211,39],[211,40,211,48],[211,49,211,52],[210,4,210,12],[210,13,210,21],[210,22,210,30],[210,31,210,39],[210,40,210,48],[210,49,210,52],[209,4,209,12],[209,13,209,21],[209,22,209,30],[209,31,209,39],[209,40,209,48],[209,49,209,52],[208,4,208,12],[208,13,208,21],[208,22,208,30],[208,31,208,39],[208,40,208,48],[208,49,208,52],[207,4,207,12],[207,13,207,21],[207,22,207,30],[207,31,207,39],[207,40,207,48],[207,49,207,52],[206,4,206,12],[206,13,206,21],[206,22,206,30],[206,31,206,39],[206,40,206,48],[206,49,206,52],[205,4,205,12],[205,13,205,21],[205,22,205,30],[205,31,205,39],[205,40,205,48],[205,49,205,52],[204,4,204,12],[204,13,204,21],[204,22,204,30],[204,31,204,39],[204,40,204,48],[204,49,204,52],[203,4,203,12],[203,13,203,21],[203,22,203,30],[203,31,203,39],[203,40,203,48],[203,49,203,52],[202,4,202,12],[202,13,202,21],[202,22,202,30],[202,31,202,39],[202,40,202,48],[202,49,202,52],[201,4,201,12],[201,13,201,21],[201,22,201,30],[201,31,201,39],[201,40,201,48],[201,49,201,52],[200,4,200,12],[200,13,200,21],[200,22,200,30],[200,31,200,39],[200,40,200,48],[200,49,200,52],[199,4,199,12],[199,13,199,21],[199,22,199,30],[199,31,199,39],[199,40,199,48],[199,49,199,52],[198,4,198,12],[198,13,198,21],[198,22,198,30],[198,31,198,39],[198,40,198,48],[198,49,198,52],[197,4,197,12],[197,13,197,21],[197,22,197,30],[197,31,197,39],[197,40,197,48],[197,49,197,52],[196,4,196,12],[196,13,196,21],[196,22,196,30],[196,31,196,39],[196,40,196,48],[196,49,196,52],[195,4,195,12],[195,13,195,21],[195,22,195,30],[195,31,195,39],[195,40,195,48],[195,49,195,52],[194,4,194,12],[194,13,194,21],[194,22,194,30],[194,31,194,39],[194,40,194,48],[194,49,194,52],[193,4,193,12],[193,13,193,21],[193,22,193,30],[193,31,193,39],[193,40,193,48],[193,49,193,52],[192,4,192,12],[192,13,192,21],[192,22,192,30],[192,31,192,39],[192,40,192,48],[192,49,192,52],[191,4,191,12],[191,13,191,21],[191,22,191,30],[191,31,191,39],[191,40,191,48],[191,49,191,52],[190,4,190,12],[190,13,190,21],[190,22,190,30],[190,31,190,39],[190,40,190,48],[190,49,190,52],[189,4,189,12],[189,13,189,21],[189,22,189,30],[189,31,189,39],[189,40,189,48],[189,49,189,52],[188,4,188,12],[188,13,188,21],[188,22,188,30],[188,31,188,39],[188,40,188,48],[188,49,188,52],[187,4,187,12],[187,13,187,21],[187,22,187,30],[187,31,187,39],[187,40,187,48],[187,49,187,52],[186,4,186,12],[186,13,186,21],[186,22,186,30],[186,31,186,39],[186,40,186,48],[186,49,186,52],[185,4,185,12],[185,13,185,21],[185,22,185,30],[185,31,185,39],[185,40,185,48],[185,49,185,52],[184,4,184,12],[184,13,184,21],[184,22,184,30],[184,31,184,39],[184,40,184,48],[184,49,184,52],[183,4,183,12],[183,13,183,21],[183,22,183,30],[183,31,183,39],[183,40,183,48],[183,49,183,52],[182,4,182,12],[182,13,182,21],[182,22,182,30],[182,31,182,39],[182,40,182,48],[182,49,182,52],[181,4,181,12],[181,13,181,21],[181,22,181,30],[181,31,181,39],[181,40,181,48],[181,49,181,52],[180,4,180,12],[180,13,180,21],[180,22,180,30],[180,31,180,39],[180,40,180,48],[180,49,180,52],[179,4,179,12],[179,13,179,21],[179,22,179,30],[179,31,179,39],[179,40,179,48],[179,49,179,52],[178,4,178,12],[178,13,178,21],[178,22,178,30],[178,31,178,39],[178,40,178,48],[178,49,178,52],[177,4,177,12],[177,13,177,21],[177,22,177,30],[177,31,177,39],[177,40,177,48],[177,49,177,52],[176,4,176,12],[176,13,176,21],[176,22,176,30],[176,31,176,39],[176,40,176,48],[176,49,176,52],[175,4,175,12],[175,13,175,21],[175,22,175,30],[175,31,175,39],[175,40,175,48],[175,49,175,52],[174,4,174,12],[174,13,174,21],[174,22,174,30],[174,31,174,39],[174,40,174,48],[174,49,174,52],[173,4,173,12],[173,13,173,21],[173,22,173,30],[173,31,173,39],[173,40,173,48],[173,49,173,52],[172,4,172,12],[172,13,172,21],[172,22,172,30],[172,31,172,39],[172,40,172,48],[172,49,172,52],[171,4,171,12],[171,13,171,21],[171,22,171,30],[171,31,171,39],[171,40,171,48],[171,49,171,52],[170,4,170,12],[170,13,170,21],[170,22,170,30],[170,31,170,39],[170,40,170,48],[170,49,170,52],[169,4,169,12],[169,13,169,21],[169,22,169,30],[169,31,169,39],[169,40,169,48],[169,49,169,52],[168,4,168,12],[168,13,168,21],[168,22,168,30],[168,31,168,39],[168,40,168,48],[168,49,168,52],[167,4,167,12],[167,13,167,21],[167,22,167,30],[167,31,167,39],[167,40,167,48],[167,49,167,52],[166,4,166,12],[166,13,166,21],[166,22,166,30],[166,31,166,39],[166,40,166,48],[166,49,166,52],[165,4,165,12],[165,13,165,21],[165,22,165,30],[165,31,165,39],[165,40,165,48],[165,49,165,52],[164,4,164,12],[164,13,164,21],[164,22,164,30],[164,31,164,39],[164,40,164,48],[164,49,164,52],[163,4,163,12],[163,13,163,21],[163,22,163,30],[163,31,163,39],[163,40,163,48],[163,49,163,52],[162,4,162,12],[162,13,162,21],[162,22,162,30],[162,31,162,39],[162,40,162,48],[162,49,162,52],[161,4,161,12],[161,13,161,21],[161,22,161,30],[161,31,161,39],[161,40,161,48],[161,49,161,52],[160,4,160,12],[160,13,160,21],[160,22,160,30],[160,31,160,39],[160,40,160,48],[160,49,160,52],[159,4,159,12],[159,13,159,21],[159,22,159,30],[159,31,159,39],[159,40,159,48],[159,49,159,52],[158,4,158,12],[158,13,158,21],[158,22,158,30],[158,31,158,39],[158,40,158,48],[158,49,158,52],[157,4,157,12],[157,13,157,21],[157,22,157,30],[157,31,157,39],[157,40,157,48],[157,49,157,52],[156,4,156,12],[156,13,156,21],[156,22,156,30],[156,31,156,39],[156,40,156,48],[156,49,156,52],[155,4,155,12],[155,13,155,21],[155,22,155,30],[155,31,155,39],[155,40,155,48],[155,49,155,52],[154,4,154,12],[154,13,154,21],[154,22,154,30],[154,31,154,39],[154,40,154,48],[154,49,154,52],[153,4,153,12],[153,13,153,21],[153,22,153,30],[153,31,153,39],[153,40,153,48],[153,49,153,52],[152,4,152,12],[152,13,152,21],[152,22,152,30],[152,31,152,39],[152,40,152,48],[152,49,152,52],[148,3,148,39],[150,31,151,39],[150,40,151,48],[150,49,151,52],[151,4,151,12],[151,13,151,21],[151,22,151,30],[129,2,129,57],[131,2,131,57],[133,2,133,29],[137,2,143,57],[146,3,146,57],[147,3,147,57],[122,4,122,19],[122,20,122,25],[125,2,125,57],[126,2,126,57],[127,2,127,57],[128,2,128,57],[116,44,116,51],[116,53,116,57],[121,4,121,19],[121,20,121,25],[121,27,121,29],[121,30,121,55],[116,6,116,10],[116,11,116,16],[116,17,116,23],[116,30,116,34],[116,36,116,41],[116,25,116,29],[113,12,113,15],[113,44,113,51],[113,53,113,57],[115,12,115,15],[115,17,115,23],[115,30,115,34],[115,36,115,41],[115,44,115,51],[115,53,115,57],[115,25,115,29],[112,12,112,15],[112,17,112,24],[112,30,112,33],[112,36,112,43],[112,53,112,57],[112,25,112,29],[111,12,111,15],[111,17,111,24],[111,30,111,33],[111,36,111,43],[111,53,111,57],[111,25,111,29],[110,12,110,15],[110,17,110,24],[110,30,110,33],[110,36,110,43],[110,53,110,57],[110,25,110,29],[109,12,109,15],[109,17,109,24],[109,30,109,33],[109,36,109,43],[109,53,109,57],[109,25,109,29],[108,12,108,15],[108,17,108,24],[108,30,108,33],[108,36,108,43],[108,53,108,57],[108,25,108,29],[107,12,107,15],[107,17,107,24],[107,30,107,33],[107,36,107,43],[107,53,107,57],[107,25,107,29],[106,12,106,15],[106,17,106,24],[106,30,106,33],[106,36,106,43],[106,53,106,57],[106,25,106,29],[105,12,105,15],[105,17,105,24],[105,30,105,33],[105,36,105,43],[105,53,105,57],[105,25,105,29],[104,12,104,15],[104,17,104,24],[104,30,104,33],[104,36,104,43],[104,53,104,57],[104,25,104,29],[103,12,103,15],[103,17,103,24],[103,30,103,33],[103,36,103,43],[103,53,103,57],[103,25,103,29],[102,12,102,15],[102,17,102,24],[102,30,102,33],[102,36,102,43],[102,53,102,57],[102,25,102,29],[101,12,101,15],[101,17,101,24],[101,30,101,33],[101,36,101,43],[101,53,101,57],[101,25,101,29],[100,12,100,15],[100,17,100,24],[100,30,100,33],[100,36,100,43],[100,53,100,57],[100,25,100,29],[99,12,99,15],[99,17,99,24],[99,30,99,33],[99,36,99,43],[99,53,99,57],[99,25,99,29],[98,12,98,15],[98,17,98,24],[98,30,98,33],[98,36,98,43],[98,53,98,57],[98,25,98,29],[97,12,97,15],[97,17,97,24],[97,30,97,33],[97,36,97,43],[97,53,97,57],[97,25,97,29],[96,12,96,15],[96,17,96,24],[96,30,96,33],[96,36,96,43],[96,53,96,57],[96,25,96,29],[95,12,95,15],[95,17,95,24],[95,30,95,33],[95,36,95,43],[95,53,95,57],[95,25,95,29],[94,12,94,15],[94,17,94,24],[94,30,94,33],[94,36,94,43],[94,53,94,57],[94,25,94,29],[93,12,93,15],[93,17,93,24],[93,30,93,33],[93,36,93,43],[93,53,93,57],[93,25,93,29],[92,12,92,15],[92,17,92,24],[92,30,92,33],[92,36,92,43],[92,53,92,57],[92,25,92,29],[91,12,91,15],[91,17,91,24],[91,30,91,33],[91,36,91,43],[91,53,91,57],[91,25,91,29],[90,12,90,15],[90,17,90,24],[90,30,90,33],[90,36,90,43],[90,53,90,57],[90,25,90,29],[89,12,89,15],[89,17,89,24],[89,30,89,33],[89,36,89,43],[89,53,89,57],[89,25,89,29],[88,12,88,15],[88,17,88,24],[88,30,88,33],[88,36,88,43],[88,53,88,57],[88,25,88,29],[87,12,87,15],[87,17,87,24],[87,30,87,33],[87,36,87,43],[87,53,87,57],[87,25,87,29],[86,12,86,15],[86,17,86,24],[86,30,86,33],[86,36,86,43],[86,53,86,57],[86,25,86,29],[85,12,85,15],[85,17,85,24],[85,30,85,33],[85,36,85,43],[85,53,85,57],[85,25,85,29],[84,12,84,15],[84,17,84,24],[84,30,84,33],[84,36,84,43],[84,53,84,57],[84,25,84,29],[83,12,83,15],[83,17,83,24],[83,30,83,33],[83,36,83,43],[83,53,83,57],[83,25,83,29],[82,12,82,15],[82,17,82,24],[82,30,82,33],[82,36,82,43],[82,53,82,57],[82,25,82,29],[81,12,81,15],[81,17,81,24],[81,30,81,33],[81,36,81,43],[81,53,81,57],[81,25,81,29],[80,12,80,15],[80,17,80,24],[80,30,80,33],[80,36,80,43],[80,53,80,57],[80,25,80,29],[79,12,79,15],[79,17,79,24],[79,30,79,33],[79,36,79,43],[79,53,79,57],[79,25,79,29],[78,12,78,15],[78,17,78,24],[78,30,78,33],[78,36,78,43],[78,53,78,57],[78,25,78,29],[77,12,77,15],[77,17,77,24],[77,30,77,33],[77,36,77,43],[77,53,77,57],[77,25,77,29],[76,12,76,15],[76,17,76,24],[76,30,76,33],[76,36,76,43],[76,53,76,57],[76,25,76,29],[75,12,75,15],[75,17,75,24],[75,30,75,33],[75,36,75,43],[75,53,75,57],[75,25,75,29],[74,12,74,15],[74,17,74,24],[74,30,74,33],[74,36,74,43],[74,53,74,57],[74,25,74,29],[73,12,73,15],[73,17,73,24],[73,30,73,33],[73,36,73,43],[73,53,73,57],[73,25,73,29],[72,12,72,15],[72,17,72,24],[72,30,72,33],[72,36,72,43],[72,53,72,57],[72,25,72,29],[71,12,71,15],[71,17,71,24],[71,30,71,33],[71,36,71,43],[71,53,71,57],[71,25,71,29],[70,12,70,15],[70,17,70,24],[70,30,70,33],[70,36,70,43],[70,53,70,57],[70,25,70,29],[69,12,69,15],[69,17,69,24],[69,30,69,33],[69,36,69,43],[69,53,69,57],[69,25,69,29],[68,12,68,15],[68,17,68,24],[68,30,68,33],[68,36,68,43],[68,53,68,57],[68,25,68,29],[67,12,67,15],[67,17,67,24],[67,30,67,33],[67,36,67,43],[67,53,67,57],[67,25,67,29],[66,12,66,15],[66,17,66,24],[66,30,66,33],[66,36,66,43],[66,53,66,57],[66,25,66,29],[65,12,65,15],[65,17,65,24],[65,30,65,33],[65,36,65,43],[65,53,65,57],[65,25,65,29],[64,12,64,15],[64,17,64,24],[64,30,64,33],[64,36,64,43],[64,53,64,57],[64,25,64,29],[63,12,63,15],[63,17,63,24],[63,30,63,33],[63,36,63,43],[63,53,63,57],[63,25,63,29],[62,12,62,15],[62,17,62,24],[62,30,62,33],[62,36,62,43],[62,53,62,57],[62,25,62,29],[61,12,61,15],[61,17,61,24],[61,30,61,33],[61,36,61,43],[61,53,61,57],[61,25,61,29],[60,12,60,15],[60,17,60,24],[60,30,60,33],[60,36,60,43],[60,53,60,57],[60,25,60,29],[59,12,59,15],[59,17,59,24],[59,30,59,33],[59,36,59,43],[59,53,59,57],[58,12,58,15],[58,17,58,24],[58,30,58,33],[58,36,58,43],[58,53,58,57],[57,12,57,15],[57,17,57,24],[57,30,57,33],[57,36,57,43],[57,53,57,57],[56,12,56,15],[56,17,56,24],[56,30,56,33],[56,36,56,43],[56,53,56,57],[55,12,55,15],[55,17,55,24],[55,30,55,33],[55,36,55,43],[55,53,55,57],[54,12,54,15],[54,17,54,24],[54,30,54,33],[54,36,54,43],[54,53,54,57],[52,36,52,43],[52,53,52,57],[53,12,53,15],[53,17,53,24],[53,30,53,33],[53,36,53,43],[53,53,53,57],[52,25,52,29],[51,85,51,95],[51,96,51,113],[51,114,51,122],[51,123,51,124],[51,125,51,134],[52,3,52,10],[52,12,52,15],[52,17,52,24],[52,30,52,34],[49,73,49,74],[49,76,49,78],[51,3,51,10],[51,12,51,15],[51,17,51,24],[51,30,51,34],[51,36,51,43],[51,44,51,51],[51,53,51,57],[43,3,43,54],[45,3,45,55],[46,3,46,55],[49,3,49,52],[49,64,49,68],[49,69,49,72],[39,2,39,7],[39,8,39,17],[39,18,39,23],[40,2,40,7],[40,8,40,17],[41,8,41,17],[35,6,35,23],[35,31,35,36],[35,44,35,57],[36,14,36,23],[38,2,38,23],[38,27,38,57],[31,2,31,11],[31,14,31,23],[31,27,31,36],[31,39,31,57],[34,6,34,23],[34,31,34,57],[24,2,24,13],[24,14,24,23],[28,2,28,23],[28,25,28,26],[28,27,28,36],[28,39,28,57],[22,2,22,5],[22,6,22,23],[22,27,22,30],[22,31,22,57],[23,2,23,5],[23,6,23,23],[23,27,23,30],[23,31,23,36],[23,44,23,57],[17,2,17,12],[17,25,17,26],[17,27,17,36],[17,39,17,57],[19,2,19,11],[19,14,19,23],[19,27,19,36],[19,39,19,57],[9,1,9,57],[10,2,10,57],[11,2,12,57],[14,2,14,57],[16,2,16,23],[16,25,16,26],[16,27,16,36],[16,39,16,57]]}
[]
[]
[]
[]
[]
[]
[]
[]
[]
[null,"Community™ Market Compensation & Benefits Survey"]
[null,null,"Registration Form for NGOs and Commercial Development Organizations"]
[null,null,"Please fill out this form completely in order to ensure your subscription can be processed quickly"]
[]
[]
[]
[null,null,"Purchase Authorized by"]
[null,null,{"$f":"IF(ISBLANK(OrgName),\"\",OrgName)","v":""},null,null,null,null,null,null,null,null,null,null,null,null,null,null,null,null,null,null,null,null,null,null,{"$f":"IF(ISBLANK(SubscriberSalutation),\"\",SubscriberSalutation)","v":""},null,{"$f":"IF(ISBLANK(SubscriberFirstName),\"\",SubscriberFirstName)","v":""},null,null,null,null,null,null,null,null,null,null,null,{"$f":"IF(ISBLANK(SubscriberLastName),\"\",SubscriberLastName)","v":""}]
[null,null,"Organization (Subscriber)",null,null,null,null,null,null,null,null,null,null,null,null,null,null,null,null,null,null,null,null,null,null,"Title",null,"Given Name(s)",null,null,null,null,null,null,null,null,null,null,null,"Surname(s)"]
[]
[null,null,{"$f":"IF(ISBLANK(SubscriberTitle),\"\",SubscriberTitle)","v":""},null,null,null,null,null,null,null,null,null,null,null,{"$f":"IF(ISBLANK(SubscriberEmail),\"\",SubscriberEmail)","v":""},null,null,null,null,null,null,null,null,null,null,null,null,{"$f":"IF(ISBLANK(SubscriberPhone),\"\",SubscriberPhone)","v":""},null,null,null,null,null,null,null,null,null,null,null,{"$f":"IF(ISBLANK(SubscriberSkype),\"\",SubscriberSkype)","v":""}]
[null,null,"Job Title",null,null,null,null,null,null,null,null,null,null,null,"Email",null,null,null,null,null,null,null,null,null,null,null,null,"Phone (including country code)",null,null,null,null,null,null,null,null,null,null,null,"Skype Address"]
[]
[null,null,"Address 1",null,null,null,{"$f":"IF(ISBLANK(SubscriberAddress1),\"\",SubscriberAddress1)","v":""},null,null,null,null,null,null,null,null,null,null,null,null,null,null,null,null,null,null,null,null,"Address 2",null,null,null,{"$f":"IF(ISBLANK(SubscriberAddress2),\"\",SubscriberAddress2)","v":""}]
[null,null,"City",null,null,null,{"$f":"IF(ISBLANK(SubscriberCity),\"\",SubscriberCity)","v":""},null,null,null,null,null,null,null,null,null,null,null,null,null,null,null,null,null,null,null,null,"Country",null,null,null,{"$f":"IF(ISBLANK(SubscriberCountry),\"\",SubscriberCountry)","v":""},null,null,null,null,null,null,null,"Postal Code",null,null,null,null,{"$f":"IF(ISBLANK(SubscriberPostalCode),\"\",SubscriberPostalCode)","v":""}]
[null,null,"State/Province (US/Canada only)",null,null,null,null,null,null,null,null,null,null,null,{"$f":"IF(ISBLANK(SubscriberState),\"\",SubscriberState)","v":""}]
[]
[]
[null,null,"Billing Contact Information (if different than purchaser)"]
[null,null,{"$f":"IF(ISBLANK(BillingOrgName),\"\",BillingOrgName)","v":""},null,null,null,null,null,null,null,null,null,null,null,null,null,null,null,null,null,null,null,null,null,null,{"$f":"IF(ISBLANK(BillingSalutation),\"\",BillingSalutation)","v":""},null,{"$f":"IF(ISBLANK(BillingGivenNames),\"\",BillingGivenNames)","v":""},null,null,null,null,null,null,null,null,null,null,null,{"$f":"IF(ISBLANK(BillingSurnames),\"\",BillingSurnames)","v":""}]
[null,null,"Company",null,null,null,null,null,null,null,null,null,null,null,null,null,null,null,null,null,null,null,null,null,null,"Title",null,"Given Name(s)",null,null,null,null,null,null,null,null,null,null,null,"Surname(s)"]
[]
[null,null,{"$f":"IF(ISBLANK(BillingJobTitle),\"\",BillingJobTitle)","v":""},null,null,null,null,null,null,null,null,null,null,null,{"$f":"IF(ISBLANK(BillingEmail),\"\",BillingEmail)","v":""},null,null,null,null,null,null,null,null,null,null,null,null,{"$f":"IF(ISBLANK(BillingPhone),\"\",BillingPhone)","v":""},null,null,null,null,null,null,null,null,null,null,null,{"$f":"IF(ISBLANK(BillingSkype),\"\",BillingSkype)","v":""}]
[null,null,"Job Title",null,null,null,null,null,null,null,null,null,null,null,"Email",null,null,null,null,null,null,null,null,null,null,null,null,"Phone (including country code)",null,null,null,null,null,null,null,null,null,null,null,"Skype Address"]
[]
[null,null,"Address 1",null,null,null,{"$f":"IF(ISBLANK(BillingAddress1),\"\",BillingAddress1)","v":""},null,null,null,null,null,null,null,null,null,null,null,null,null,null,null,null,null,null,null,null,"Address 2",null,null,null,{"$f":"IF(ISBLANK(BillingAddress2),\"\",BillingAddress2)","v":""}]
[null,null,"City",null,null,null,{"$f":"IF(ISBLANK(BillingCity),\"\",BillingCity)","v":""},null,null,null,null,null,null,null,null,null,null,null,null,null,null,null,null,null,null,null,null,"Country",null,null,null,{"$f":"IF(ISBLANK(BillingCountry),\"\",BillingCountry)","v":""},null,null,null,null,null,null,null,"Postal Code",null,null,null,null,{"$f":"IF(ISBLANK(BillingPostalCode),\"\",BillingPostalCode)","v":""}]
[null,null,"State/Province (US/Canada only)",null,null,null,null,null,null,null,null,null,null,null,{"$f":"IF(ISBLANK(BillingState),\"\",BillingState)","v":""}]
[]
[null,null,"(Birches Group use only)",null,null,null,null,null,null,null,null,null,null,null,null,null,null,null,null,null,null,null,null,null,null,null,null,{"$f":"IF(ISBLANK(PurchaseOrderNo),\"\",PurchaseOrderNo)","v":""}]
[null,null,"Account Number:",null,null,null,null,null,{"$f":"AccountNumber","v":0},null,null,null,null,null,null,null,null,null,{"$f":"'Order Form'!U61","v":"USD"},null,null,null,null,null,null,null,null,"Purchase Order Number (optional)"]
[null,null,"Order Number:",null,null,null,null,null,{"$f":"OrderNumber","v":0}]
[null,null,"Effective Date:",null,null,null,null,null,{"$f":"'Order Form'!SubscriptionStartDate","v":"00:00:00"}]
[]
[null,null,null,"For each of the countries you have selected, please indicate the following information:",null,null,null,null,null,null,null,null,null,null,null,null,null,null,null,null,null,null,null,null,null,null,null,null,null,null,null,null,null,null,null,null,null,null,null,null,null,null,null,null,null,null,null,null,null,null,null,null,null,null,null,null,null,null,null,null,null,null,null,null,null,null,null,null,null,null,null,null,null,null,null,null,null,null,null,null,null,null,null,null,null,"Export area for Reg Database",null,null,null,null,null,null,null,null,null,null,null,null,null,null,null,null,null,null,null,null,null,null,null,null,null,null,null,null,null,null,null,null,null,null,null,null,null,null,null,null,null,null,null,null,null,null,null,null,null,null,null,null,null,null,null,null,"These are working columns, will be hidden when finished with coding"]
[]
[null,null,null,"  1)  Data Submission.  Indicate Yes or No for Data Submission.  Note there is an additional fee if you do not submit your data,",null,null,null,null,null,null,null,null,null,null,null,null,null,null,null,null,null,null,null,null,null,null,null,null,null,null,null,null,null,null,null,null,null,null,null,null,null,null,null,null,null,null,null,null,null,null,null,null,null,null,null,null,null,null,null,null,null,null,null,null,"Organization Name","Account Number","Order Number","Billing Contact","Billing Title","Address1","Address2","Billing State","Billing City","Billing Postal Code","Billing Country","Billing Phone","Billing E-Mail","Organization Type","Subscription Type","Subscription Start Date","Subscription End Date","Currency","Purchase Order"]
[null,null,null,"  2)  Reports or Indigo™.  For each country, indicate which option you wish to choose for each country.  \n       For Reports, indicate if you wish to add multisector access (included for Indigo™ subscribers automatically).",null,null,null,null,null,null,null,null,null,null,null,null,null,null,null,null,null,null,null,null,null,null,null,null,null,null,null,null,null,null,null,null,null,null,null,null,null,null,null,null,null,null,null,null,null,null,null,null,null,null,null,null,null,null,null,null,null,null,null,null,{"$f":"C17","v":""},{"$f":"AccountNumber","v":0},{"$f":"I41","v":0},{"$f":"IF(AB29=\"\",Z17&\" \"&AB17&\" \"&AN17,Z29&\" \"&AB29&\" \"&AN29)","v":"  "},{"$f":"IF(C32=\"\",C20,C32)","v":""},{"$f":"IF(G35=\"\",G23,G35)","v":""},{"$f":"IF(AF35=\"\",AF23,AF35)","v":""},{"$f":"IF(O37=\"\",IF(O25=\"\",\"\", \", \"&VLOOKUP(O25,StateAbbr,2,FALSE)), \", \"&VLOOKUP(O37,StateAbbr,2,FALSE))","v":""},{"$f":"IF(G36=\"\",G24,G36)","v":""},{"$f":"IF(AS36=\"\",AS24,AS36)","v":""},{"$f":"IF(AF36=\"\",AF24,AF36)","v":""},{"$f":"IF(AB32=\"\",AB20,AB32)","v":""},{"$f":"IF(O32=\"\",O20,O32)","v":""},{"$f":"'Order Form'!L101","v":"Type of Organization"},{"$f":"ProductOption","v":"Product Option"},{"$f":"'Order Form'!L105","v":"00:00:00"},{"$f":"DATE(YEAR(CB47)+1,MONTH(CB47), DAY(CB47)-1)","v":"1900-12-30"},{"$f":"Currency","v":"USD"},{"$f":"IF(ISBLANK(PurchaseOrderNo),\"\",PurchaseOrderNo)","v":""}]
[null,null,null,"  3)  Custom Cut.  For each country, indicate if you would like to add a Custom Cut to your subscription."]
[null,null,null,null,null,null,null,null,null,null,null,null,null,null,null,null,null,null,null,null,null,null,null,null,null,null,null,null,null,null,null,null,null,null,null,null,null,null,null,null,null,null,null,null,null,null,null,null,null,null,null,null,null,null,null,null,null,null,null,null,null,null,null,null,"cc Emails",null,null,null,null,"Sales Rep"]
[null,null,null,"Note:  You can use copy/paste commands, or drag values down, to copy information to multiple lines.",null,null,null,null,null,null,null,null,null,null,null,null,null,null,null,null,null,null,null,null,null,null,null,null,null,null,null,null,null,null,null,null,null,null,null,null,null,null,null,null,null,null,null,null,null,null,null,null,null,null,null,null,null,null,null,null,null,null,null,null,{"$f":"ccemails","v":0},null,null,null,null,{"$f":"IF(ISBLANK(SalesRep),\"support@birchesgroup.com\",SalesRep)","v":"support@birchesgroup.com"},null,null,null,{"$f":"IF(NGOGPChoice=\"no\",\"\",\"Data:NGO Global Pay:Subscription\")","v":""},null,{"$f":"IF(NGOGPChoice=\"No\",\"\",NGOGlobalPayFee)","v":""},{"$f":"IF(M114=\"No\",\"Data:NGO Global Pay:Non-Participant Surcharge\",\"\")","v":""},null,null,{"$f":"BB114","v":0}]
[null,null,null,null,null,null,null,null,null,null,null,null,null,null,null,null,null,null,null,null,null,null,null,null,null,null,null,null,null,null,null,null,null,null,null,null,null,null,null,null,null,null,null,null,null,null,null,null,null,null,null,null,null,null,null,null,null,null,null,null,null,null,null,null,"Tax Gross-Up",{"$f":"U123","v":0}]
[null,null,null,"Country",null,null,null,null,null,null,null,null,"Will You Submit Data (Y/N)?",null,null,null,null,"Profiles Available",null,null,null,null,null,null,null,{"$f":"\" Reports (\"&TEXT(NGOLPSurvey,\"$#,##0\")&\") or Indigo™ Access (\"&TEXT((NGOLPSurvey+Indigo),\"$#,##0\")&\")\"","v":{"$error":"#N/A"}},null,null,null,null,{"$f":"\"Multisector \nAdd-on\"&\" (\"&\nTEXT(MSAddOn,\"$#,##0\")&\")          \"\n&\"(Reports Only)\"","v":{"$error":"#N/A"}},null,null,null,null,null,"Custom Cuts",null,null,null,null,null,null,null,"NGO Global Pay",null,null,null,null,null,null,null,"Expedited Reports","Non-Participation Surcharge*\n(50% of survey fees)",null,null,null,null,null,null,null,null,null,null,null,null,null,null,null,null,null,null,null,null,null,null,null,null,null,null,null,null,null,null,null,"Information about the person who responded ",null,null,null,null,null,null,null,null,null,null,"Survey Data Contacts",null,null,null,null,null,null,null,null,null,null,null,null,null,null,null,null,null,"HQ/Regional Contacts",null,null,null,null,null,null,null,null,"Survey\nAccess",null,"Billing"]
[null,null,null,null,null,null,null,null,null,null,null,null,"Required\nEntry",null,null,null,null,null,null,null,null,null,null,null,null,"Required\nEntry",null,null,null,null,"Required\nEntry",null,null,null,null,null,"Required\nEntry",null,null,null,null,null,null,null,null,null,null,null,null,null,null,null,"choose",null,null,null,null,null,null,null,null,null,null,null,"Organization Name","Order Number","Class","Data:Annual Report Purchase:Country Report","Data:Annual Report Purchase:Indigo Subscription","Data:Annual Report Purchase:Multisector Add On","Custom Cut Description","Data:Specialized Data:Custom Cut","SubsectorName","Data:Specialized Data:Subsector Cut","Data:General Fees:Non-Participant Fee","Data:General Fees:Expedited Report Fee","Group Total",null,null,null,null,null,null,null,null,"Date Registered","Salutation (Mr/Ms)","First or Given Name","Last or Family Name","Name of Organization","Your Job Title","Country in which you are Located","Phone number (including country code)","Email Address","Skype Address","Number of Countries:","Country Name","Salutation (Mr/Ms)","First or Given Name","Last or Family Name","Name of Organization","Job Title","Country","Phone number (including country code)","Email Address","Skype Address - LCL","Response","EE Threshold","Next Pay Review Date","Pay Review Frequency","Survey Year","Country-Year","Survey Status","UniqueKey","Salutation (Mr/Ms)","First or Given Name","Last or Family Name","Name of Organization","Job Title","Country","Phone number (including country code)","Email Address","Skype Address - HQ","Name","E-mail Address","Send invoice to","Salutation (Mr/Ms)","First or Given Name","Last or Family Name","Name of Organization","Job Title","Country","Phone number (including country code)","Email Address","Skype Address - Billing","Notes","Response","Will provide data?","Preferred Partner?","Fee applies",null,null,"Main Product","Start Date","End Date","Pricing","MS Add-on","Custom Cut","Subsector (Subsector Name)","Participate"]
[null,null,1,null,null,null,null,null,null,null,null,null,null,null,null,null,null,{"$f":"IF(ISNA(VLOOKUP($D54,SurveyElections,2,FALSE)),\"\",VLOOKUP($D54,SurveyElections,2,FALSE))","v":""},null,null,null,null,null,null,null,null,null,null,null,null,null,null,null,null,{"$f":"IF(AND(AE54=\"x\",R54=\"NGOLP & Multisector\",Z54=\"Reports Only\"),1,0)","v":0},null,null,null,null,null,null,null,null,null,null,null,null,null,null,null,null,null,null,{"$f":"IFERROR(ROUND(IF(ISBLANK(D54),\"\",IF(M54=\"Yes\",0,IF(Z54=\"Reports Only\",NGOLPSurvey*0.5,(NGOLPSurvey+Indigo)*0.5))),0),\"\")","v":""},null,null,null,null,null,null,null,null,null,null,{"$f":"OrgName","v":0},{"$f":"OrderNumber","v":0},{"$f":"IF(ISBLANK(D54),\"\",D54)","v":""},{"$f":"IF(Z54=\"Reports Only\",NGOLPSurvey,0)","v":0},{"$f":"IF(Z54=\"Indigo™\",Indigo,0)","v":0},{"$f":"AI54*MSAddOn","v":{"$error":"#N/A"}},{"$f":"IF(ISBLANK(AK54),\"\",AK54)","v":""},{"$f":"IF(AK54=\"All Cycles\",CustomAll,0)+IF(OR(AK54=\"Cycle 1 (Apr)\", AK54=\"Cycle 2 (Jul)\", AK54=\"Cycle 3 (Oct)\"),Custom,0)","v":0},null,null,{"$f":"IF(M54=\"Yes\",\"\",BB54)","v":""},{"$f":"IF(BA54=\"Yes\",450,\"\")","v":""},{"$f":"SUM(BW54,BP54,BT54,BV54,BQ54,BR54,BX54)","v":{"$error":"#N/A"}},null,null,null,null,null,null,null,null,{"$f":"TODAY()","v":"2021-03-18"},{"$f":"$Z$17","v":""},{"$f":"$AB$17","v":""},{"$f":"$AN$17","v":""},{"$f":"$C$17","v":""},{"$f":"$C$20","v":""},{"$f":"$AF$24","v":""},{"$f":"$AB$20","v":""},{"$f":"$O$20","v":""},{"$f":"$AN$20","v":""},{"$f":"TotalIndigo","v":0},{"$f":"D54","v":0},{"$f":"VLOOKUP($CS54,SurveyDataContacts,'Survey Contacts'!$L$24,FALSE)","v":{"$error":"#N/A"}},{"$f":"VLOOKUP($CS54,SurveyDataContacts,'Survey Contacts'!$T$24,FALSE)","v":{"$error":"#N/A"}},{"$f":"VLOOKUP($CS54,SurveyDataContacts,'Survey Contacts'!$AL$24,FALSE)","v":{"$error":"#N/A"}},{"$f":"CL54","v":""},{"$f":"VLOOKUP($CS54,SurveyDataContacts,'Survey Contacts'!$BD$24,FALSE)","v":{"$error":"#N/A"}},{"$f":"VLOOKUP($CS54,SurveyDataContacts,'Survey Contacts'!$DS$24,FALSE)","v":{"$error":"#N/A"}},{"$f":"VLOOKUP($CS54,SurveyDataContacts,'Survey Contacts'!$BV$24,FALSE)","v":{"$error":"#N/A"}},{"$f":"VLOOKUP($CS54,SurveyDataContacts,'Survey Contacts'!$CQ$24,FALSE)","v":{"$error":"#N/A"}},{"$f":"VLOOKUP($CS54,SurveyDataContacts,'Survey Contacts'!$DE$24,FALSE)","v":{"$error":"#N/A"}},{"$f":"VLOOKUP($CS54,CountryInformation_Ad_Hoc,$N$150,FALSE)","v":{"$error":"#N/A"}},{"$f":"IF(DC54<16,\"15 or Less\",\"More than 15\")","v":{"$error":"#N/A"}},{"$f":"VLOOKUP($CS54,CountryInformation_Ad_Hoc,$W$150,FALSE)","v":{"$error":"#N/A"}},{"$f":"VLOOKUP($CS54,CountryInformation_Ad_Hoc,$AF$150,FALSE)","v":{"$error":"#N/A"}},{"$f":"YEAR($I$42)","v":1900},{"$f":"CS54&\" - \"&DG54","v":"0 - 1900"},null,{"$f":"CW54&CS54&DG54","v":"01900"},{"$f":"VLOOKUP($D54,HQ_Contacts,'HQ and Regional Contacts'!$Q$24,FALSE)","v":{"$error":"#N/A"}},{"$f":"VLOOKUP($D54,HQ_Contacts,'HQ and Regional Contacts'!$Y$24,FALSE)","v":{"$error":"#N/A"}},{"$f":"VLOOKUP($D54,HQ_Contacts,'HQ and Regional Contacts'!$AQ$24,FALSE)","v":{"$error":"#N/A"}},{"$f":"CW54","v":""},{"$f":"VLOOKUP($D54,HQ_Contacts,'HQ and Regional Contacts'!$BI$24,FALSE)","v":{"$error":"#N/A"}},{"$f":"VLOOKUP($D54,HQ_Contacts,'HQ and Regional Contacts'!$DX$24,FALSE)","v":{"$error":"#N/A"}},{"$f":"VLOOKUP($D54,HQ_Contacts,'HQ and Regional Contacts'!$CA$24,FALSE)","v":{"$error":"#N/A"}},{"$f":"VLOOKUP($D54,HQ_Contacts,'HQ and Regional Contacts'!$CV$24,FALSE)","v":{"$error":"#N/A"}},{"$f":"VLOOKUP($D54,HQ_Contacts,'HQ and Regional Contacts'!$DJ$24,FALSE)","v":{"$error":"#N/A"}},null,null,{"$f":"IF(ISBLANK(BillingSurnames),\"Same Individual\",\"Different Individual\")","v":"Same Individual"},{"$f":"$Z$29","v":""},{"$f":"$AB$29","v":""},{"$f":"$AN$29","v":""},{"$f":"$C$29","v":""},{"$f":"$C$32","v":""},{"$f":"$AF$36","v":""},{"$f":"$AB$32","v":""},{"$f":"$O$32","v":""},{"$f":"$AN$32","v":""},{"$f":"EV54","v":""},null,{"$f":"IF(D54=\"\",\"\",IF(M54=\"Yes\",\"Yes\",\"No\"))","v":""},"No",null,null,null,{"$f":"IF(D54=\"\",\"\",IF(#REF!=\"\",\"Report Subscriber: \",\"Indigo Subscriber: \"))","v":""},{"$f":"TEXT($I$42,\"dd-mmm-yyyy\")","v":"00-Jan-1900"},{"$f":"TEXT($CC$47,\"dd-mmm-yyyy\")&\";\"","v":"30-Dec-1900;"},{"$f":"IF('Order Form'!$L$101=\"NGO\",\"\",\" (CDO Pricing); \")","v":" (CDO Pricing); "},{"$f":"IF(AE54=\"X\",\"MS Add-on;\",\"\")","v":""},{"$f":"IF(AK54=\"\",\"\",\"Custom Cut (\"&AK54&\");\")","v":""},{"$f":"IF(#REF!=\"\",\"\",\"Subsector: \"&#REF!&\";\")","v":{"$error":"#REF!"}},{"$f":"IF(EH54=\"Yes\",\"\",\"No data to provide;\")","v":"No data to provide;"},null,{"$f":"IF(EM54=\"\",\"\",EM54&EN54&\" - \"&EO54&EP54&EQ54&ER54&ES54&ET54)","v":""}]
[null,null,{"$f":"C54+1","v":2},null,null,null,null,null,null,null,null,null,null,null,null,null,null,"",null,null,null,null,null,null,null,null,null,null,null,null,null,null,null,null,{"$f":"IF(AND(AE55=\"x\",R55=\"NGOLP & Multisector\",Z55=\"Reports Only\"),1,0)","v":0},null,null,null,null,null,null,null,null,null,null,null,null,null,null,null,null,null,null,"",null,null,null,null,null,null,null,null,null,null,0,0,"",0,0,{"$error":"#N/A"},"",0,null,null,"",{"$f":"IF(BA55=\"Yes\",450,\"\")","v":""},{"$f":"SUM(BW55,BP55,BT55,BV55,BQ55,BR55,BX55)","v":{"$error":"#N/A"}},null,null,null,null,null,null,null,null,{"$f":"TODAY()","v":"2021-03-18"},{"$f":"$Z$17","v":""},{"$f":"$AB$17","v":""},{"$f":"$AN$17","v":""},{"$f":"$C$17","v":""},{"$f":"$C$20","v":""},{"$f":"$AF$24","v":""},{"$f":"$AB$20","v":""},{"$f":"$O$20","v":""},{"$f":"$AN$20","v":""},{"$f":"TotalIndigo","v":0},{"$f":"D55","v":0},{"$f":"VLOOKUP($CS55,SurveyDataContacts,'Survey Contacts'!$L$24,FALSE)","v":{"$error":"#N/A"}},{"$f":"VLOOKUP($CS55,SurveyDataContacts,'Survey Contacts'!$T$24,FALSE)","v":{"$error":"#N/A"}},{"$f":"VLOOKUP($CS55,SurveyDataContacts,'Survey Contacts'!$AL$24,FALSE)","v":{"$error":"#N/A"}},{"$f":"CL55","v":""},{"$f":"VLOOKUP($CS55,SurveyDataContacts,'Survey Contacts'!$BD$24,FALSE)","v":{"$error":"#N/A"}},{"$f":"VLOOKUP($CS55,SurveyDataContacts,'Survey Contacts'!$DS$24,FALSE)","v":{"$error":"#N/A"}},{"$f":"VLOOKUP($CS55,SurveyDataContacts,'Survey Contacts'!$BV$24,FALSE)","v":{"$error":"#N/A"}},{"$f":"VLOOKUP($CS55,SurveyDataContacts,'Survey Contacts'!$CQ$24,FALSE)","v":{"$error":"#N/A"}},{"$f":"VLOOKUP($CS55,SurveyDataContacts,'Survey Contacts'!$DE$24,FALSE)","v":{"$error":"#N/A"}},{"$f":"VLOOKUP($CS55,CountryInformation_Ad_Hoc,$N$150,FALSE)","v":{"$error":"#N/A"}},{"$f":"IF(DC55<16,\"15 or Less\",\"More than 15\")","v":{"$error":"#N/A"}},{"$f":"VLOOKUP($CS55,CountryInformation_Ad_Hoc,$W$150,FALSE)","v":{"$error":"#N/A"}},{"$f":"VLOOKUP($CS55,CountryInformation_Ad_Hoc,$AF$150,FALSE)","v":{"$error":"#N/A"}},{"$f":"YEAR($I$42)","v":1900},{"$f":"CS55&\" - \"&DG55","v":"0 - 1900"},null,{"$f":"CW55&CS55&DG55","v":"01900"},{"$f":"VLOOKUP($D55,HQ_Contacts,'HQ and Regional Contacts'!$Q$24,FALSE)","v":{"$error":"#N/A"}},{"$f":"VLOOKUP($D55,HQ_Contacts,'HQ and Regional Contacts'!$Y$24,FALSE)","v":{"$error":"#N/A"}},{"$f":"VLOOKUP($D55,HQ_Contacts,'HQ and Regional Contacts'!$AQ$24,FALSE)","v":{"$error":"#N/A"}},{"$f":"CW55","v":""},{"$f":"VLOOKUP($D55,HQ_Contacts,'HQ and Regional Contacts'!$BI$24,FALSE)","v":{"$error":"#N/A"}},{"$f":"VLOOKUP($D55,HQ_Contacts,'HQ and Regional Contacts'!$DX$24,FALSE)","v":{"$error":"#N/A"}},{"$f":"VLOOKUP($D55,HQ_Contacts,'HQ and Regional Contacts'!$CA$24,FALSE)","v":{"$error":"#N/A"}},{"$f":"VLOOKUP($D55,HQ_Contacts,'HQ and Regional Contacts'!$CV$24,FALSE)","v":{"$error":"#N/A"}},{"$f":"VLOOKUP($D55,HQ_Contacts,'HQ and Regional Contacts'!$DJ$24,FALSE)","v":{"$error":"#N/A"}},null,null,{"$f":"IF(ISBLANK(BillingSurnames),\"Same Individual\",\"Different Individual\")","v":"Same Individual"},{"$f":"$Z$29","v":""},{"$f":"$AB$29","v":""},{"$f":"$AN$29","v":""},{"$f":"$C$29","v":""},{"$f":"$C$32","v":""},{"$f":"$AF$36","v":""},{"$f":"$AB$32","v":""},{"$f":"$O$32","v":""},{"$f":"$AN$32","v":""},{"$f":"EV55","v":""},null,{"$f":"IF(D55=\"\",\"\",IF(M55=\"Yes\",\"Yes\",\"No\"))","v":""},"No",null,null,null,{"$f":"IF(D55=\"\",\"\",IF(#REF!=\"\",\"Report Subscriber: \",\"Indigo Subscriber: \"))","v":""},{"$f":"TEXT($I$42,\"dd-mmm-yyyy\")","v":"00-Jan-1900"},{"$f":"TEXT($CC$47,\"dd-mmm-yyyy\")&\";\"","v":"30-Dec-1900;"},{"$f":"IF('Order Form'!$L$101=\"NGO\",\"\",\" (CDO Pricing); \")","v":" (CDO Pricing); "},{"$f":"IF(AE55=\"X\",\"MS Add-on;\",\"\")","v":""},{"$f":"IF(AK55=\"\",\"\",\"Custom Cut (\"&AK55&\");\")","v":""},{"$f":"IF(#REF!=\"\",\"\",\"Subsector: \"&#REF!&\";\")","v":{"$error":"#REF!"}},{"$f":"IF(EH55=\"Yes\",\"\",\"No data to provide;\")","v":"No data to provide;"},null,{"$f":"IF(EM55=\"\",\"\",EM55&EN55&\" - \"&EO55&EP55&EQ55&ER55&ES55&ET55)","v":""}]
[null,null,{"$f":"C55+1","v":3},null,null,null,null,null,null,null,null,null,null,null,null,null,null,"",null,null,null,null,null,null,null,null,null,null,null,null,null,null,null,null,0,null,null,null,null,null,null,null,null,null,null,null,null,null,null,null,null,null,null,"",null,null,null,null,null,null,null,null,null,null,0,0,"",0,0,{"$error":"#N/A"},"",0,null,null,"","",{"$error":"#N/A"},null,null,null,null,null,null,null,null,{"$f":"TODAY()","v":"2021-03-18"},"","","","","","","","","",{"$f":"TotalIndigo","v":0},{"$f":"D56","v":0},{"$f":"VLOOKUP($CS56,SurveyDataContacts,'Survey Contacts'!$L$24,FALSE)","v":{"$error":"#N/A"}},{"$f":"VLOOKUP($CS56,SurveyDataContacts,'Survey Contacts'!$T$24,FALSE)","v":{"$error":"#N/A"}},{"$f":"VLOOKUP($CS56,SurveyDataContacts,'Survey Contacts'!$AL$24,FALSE)","v":{"$error":"#N/A"}},"",{"$f":"VLOOKUP($CS56,SurveyDataContacts,'Survey Contacts'!$BD$24,FALSE)","v":{"$error":"#N/A"}},{"$f":"VLOOKUP($CS56,SurveyDataContacts,'Survey Contacts'!$DS$24,FALSE)","v":{"$error":"#N/A"}},{"$f":"VLOOKUP($CS56,SurveyDataContacts,'Survey Contacts'!$BV$24,FALSE)","v":{"$error":"#N/A"}},{"$f":"VLOOKUP($CS56,SurveyDataContacts,'Survey Contacts'!$CQ$24,FALSE)","v":{"$error":"#N/A"}},{"$f":"VLOOKUP($CS56,SurveyDataContacts,'Survey Contacts'!$DE$24,FALSE)","v":{"$error":"#N/A"}},{"$f":"VLOOKUP($CS56,CountryInformation_Ad_Hoc,$N$150,FALSE)","v":{"$error":"#N/A"}},{"$error":"#N/A"},{"$f":"VLOOKUP($CS56,CountryInformation_Ad_Hoc,$W$150,FALSE)","v":{"$error":"#N/A"}},{"$f":"VLOOKUP($CS56,CountryInformation_Ad_Hoc,$AF$150,FALSE)","v":{"$error":"#N/A"}},1900,"0 - 1900",null,"01900",{"$f":"VLOOKUP($D56,HQ_Contacts,'HQ and Regional Contacts'!$Q$24,FALSE)","v":{"$error":"#N/A"}},{"$f":"VLOOKUP($D56,HQ_Contacts,'HQ and Regional Contacts'!$Y$24,FALSE)","v":{"$error":"#N/A"}},{"$f":"VLOOKUP($D56,HQ_Contacts,'HQ and Regional Contacts'!$AQ$24,FALSE)","v":{"$error":"#N/A"}},"",{"$f":"VLOOKUP($D56,HQ_Contacts,'HQ and Regional Contacts'!$BI$24,FALSE)","v":{"$error":"#N/A"}},{"$f":"VLOOKUP($D56,HQ_Contacts,'HQ and Regional Contacts'!$DX$24,FALSE)","v":{"$error":"#N/A"}},{"$f":"VLOOKUP($D56,HQ_Contacts,'HQ and Regional Contacts'!$CA$24,FALSE)","v":{"$error":"#N/A"}},{"$f":"VLOOKUP($D56,HQ_Contacts,'HQ and Regional Contacts'!$CV$24,FALSE)","v":{"$error":"#N/A"}},{"$f":"VLOOKUP($D56,HQ_Contacts,'HQ and Regional Contacts'!$DJ$24,FALSE)","v":{"$error":"#N/A"}},null,null,{"$f":"IF(ISBLANK(BillingSurnames),\"Same Individual\",\"Different Individual\")","v":"Same Individual"},"","","","","","","","","","",null,{"$f":"IF(D56=\"\",\"\",IF(M56=\"Yes\",\"Yes\",\"No\"))","v":""},"No",null,null,null,{"$f":"IF(D56=\"\",\"\",IF(#REF!=\"\",\"Report Subscriber: \",\"Indigo Subscriber: \"))","v":""},"00-Jan-1900",{"$f":"TEXT($CC$47,\"dd-mmm-yyyy\")&\";\"","v":"30-Dec-1900;"},{"$f":"IF('Order Form'!$L$101=\"NGO\",\"\",\" (CDO Pricing); \")","v":" (CDO Pricing); "},{"$f":"IF(AE56=\"X\",\"MS Add-on;\",\"\")","v":""},{"$f":"IF(AK56=\"\",\"\",\"Custom Cut (\"&AK56&\");\")","v":""},{"$f":"IF(#REF!=\"\",\"\",\"Subsector: \"&#REF!&\";\")","v":{"$error":"#REF!"}},"No data to provide;",null,""]
[null,null,4,null,null,null,null,null,null,null,null,null,null,null,null,null,null,"",null,null,null,null,null,null,null,null,null,null,null,null,null,null,null,null,0,null,null,null,null,null,null,null,null,null,null,null,null,null,null,null,null,null,null,"",null,null,null,null,null,null,null,null,null,null,0,0,"",0,0,{"$error":"#N/A"},"",0,null,null,"","",{"$error":"#N/A"}]
[null,null,5,null,null,null,null,null,null,null,null,null,null,null,null,null,null,"",null,null,null,null,null,null,null,null,null,null,null,null,null,null,null,null,0,null,null,null,null,null,null,null,null,null,null,null,null,null,null,null,null,null,null,"",null,null,null,null,null,null,null,null,null,null,0,0,"",0,0,{"$error":"#N/A"},"",0,null,null,"","",{"$error":"#N/A"}]
[null,null,6,null,null,null,null,null,null,null,null,null,null,null,null,null,null,"",null,null,null,null,null,null,null,null,null,null,null,null,null,null,null,null,0,null,null,null,null,null,null,null,null,null,null,null,null,null,null,null,null,null,null,"",null,null,null,null,null,null,null,null,null,null,0,0,"",0,0,{"$error":"#N/A"},"",0,null,null,"","",{"$error":"#N/A"}]
[null,null,7,null,null,null,null,null,null,null,null,null,null,null,null,null,null,"",null,null,null,null,null,null,null,null,null,null,null,null,null,null,null,null,0,null,null,null,null,null,null,null,null,null,null,null,null,null,null,null,null,null,null,"",null,null,null,null,null,null,null,null,null,null,0,0,"",0,0,{"$error":"#N/A"},"",0,null,null,"","",{"$error":"#N/A"}]
[null,null,8,null,null,null,null,null,null,null,null,null,null,null,null,null,null,"",null,null,null,null,null,null,null,null,null,null,null,null,null,null,null,null,0,null,null,null,null,null,null,null,null,null,null,null,null,null,null,null,null,null,null,"",null,null,null,null,null,null,null,null,null,null,0,0,"",0,0,{"$error":"#N/A"},"",0,null,null,"","",{"$error":"#N/A"}]
[null,null,9,null,null,null,null,null,null,null,null,null,null,null,null,null,null,"",null,null,null,null,null,null,null,null,null,null,null,null,null,null,null,null,0,null,null,null,null,null,null,null,null,null,null,null,null,null,null,null,null,null,null,"",null,null,null,null,null,null,null,null,null,null,0,0,"",0,0,{"$error":"#N/A"},"",0,null,null,"","",{"$error":"#N/A"}]
[null,null,10,null,null,null,null,null,null,null,null,null,null,null,null,null,null,"",null,null,null,null,null,null,null,null,null,null,null,null,null,null,null,null,0,null,null,null,null,null,null,null,null,null,null,null,null,null,null,null,null,null,null,"",null,null,null,null,null,null,null,null,null,null,0,0,"",0,0,{"$error":"#N/A"},"",0,null,null,"","",{"$error":"#N/A"}]
[null,null,11,null,null,null,null,null,null,null,null,null,null,null,null,null,null,"",null,null,null,null,null,null,null,null,null,null,null,null,null,null,null,null,0,null,null,null,null,null,null,null,null,null,null,null,null,null,null,null,null,null,null,"",null,null,null,null,null,null,null,null,null,null,0,0,"",0,0,{"$error":"#N/A"},"",0,null,null,"","",{"$error":"#N/A"}]
[null,null,12,null,null,null,null,null,null,null,null,null,null,null,null,null,null,"",null,null,null,null,null,null,null,null,null,null,null,null,null,null,null,null,0,null,null,null,null,null,null,null,null,null,null,null,null,null,null,null,null,null,null,"",null,null,null,null,null,null,null,null,null,null,0,0,"",0,0,{"$error":"#N/A"},"",0,null,null,"","",{"$error":"#N/A"}]
[null,null,13,null,null,null,null,null,null,null,null,null,null,null,null,null,null,"",null,null,null,null,null,null,null,null,null,null,null,null,null,null,null,null,0,null,null,null,null,null,null,null,null,null,null,null,null,null,null,null,null,null,null,"",null,null,null,null,null,null,null,null,null,null,0,0,"",0,0,{"$error":"#N/A"},"",0,null,null,"","",{"$error":"#N/A"}]
[null,null,14,null,null,null,null,null,null,null,null,null,null,null,null,null,null,"",null,null,null,null,null,null,null,null,null,null,null,null,null,null,null,null,0,null,null,null,null,null,null,null,null,null,null,null,null,null,null,null,null,null,null,"",null,null,null,null,null,null,null,null,null,null,0,0,"",0,0,{"$error":"#N/A"},"",0,null,null,"","",{"$error":"#N/A"}]
[null,null,15,null,null,null,null,null,null,null,null,null,null,null,null,null,null,"",null,null,null,null,null,null,null,null,null,null,null,null,null,null,null,null,0,null,null,null,null,null,null,null,null,null,null,null,null,null,null,null,null,null,null,"",null,null,null,null,null,null,null,null,null,null,0,0,"",0,0,{"$error":"#N/A"},"",0,null,null,"","",{"$error":"#N/A"}]
[null,null,16,null,null,null,null,null,null,null,null,null,null,null,null,null,null,"",null,null,null,null,null,null,null,null,null,null,null,null,null,null,null,null,0,null,null,null,null,null,null,null,null,null,null,null,null,null,null,null,null,null,null,"",null,null,null,null,null,null,null,null,null,null,0,0,"",0,0,{"$error":"#N/A"},"",0,null,null,"","",{"$error":"#N/A"}]
[null,null,17,null,null,null,null,null,null,null,null,null,null,null,null,null,null,"",null,null,null,null,null,null,null,null,null,null,null,null,null,null,null,null,0,null,null,null,null,null,null,null,null,null,null,null,null,null,null,null,null,null,null,"",null,null,null,null,null,null,null,null,null,null,0,0,"",0,0,{"$error":"#N/A"},"",0,null,null,"","",{"$error":"#N/A"}]
[null,null,18,null,null,null,null,null,null,null,null,null,null,null,null,null,null,"",null,null,null,null,null,null,null,null,null,null,null,null,null,null,null,null,0,null,null,null,null,null,null,null,null,null,null,null,null,null,null,null,null,null,null,"",null,null,null,null,null,null,null,null,null,null,0,0,"",0,0,{"$error":"#N/A"},"",0,null,null,"","",{"$error":"#N/A"}]
[null,null,19,null,null,null,null,null,null,null,null,null,null,null,null,null,null,"",null,null,null,null,null,null,null,null,null,null,null,null,null,null,null,null,0,null,null,null,null,null,null,null,null,null,null,null,null,null,null,null,null,null,null,"",null,null,null,null,null,null,null,null,null,null,0,0,"",0,0,{"$error":"#N/A"},"",0,null,null,"","",{"$error":"#N/A"}]
[null,null,20,null,null,null,null,null,null,null,null,null,null,null,null,null,null,"",null,null,null,null,null,null,null,null,null,null,null,null,null,null,null,null,0,null,null,null,null,null,null,null,null,null,null,null,null,null,null,null,null,null,null,"",null,null,null,null,null,null,null,null,null,null,0,0,"",0,0,{"$error":"#N/A"},"",0,null,null,"","",{"$error":"#N/A"}]
[null,null,21,null,null,null,null,null,null,null,null,null,null,null,null,null,null,"",null,null,null,null,null,null,null,null,null,null,null,null,null,null,null,null,0,null,null,null,null,null,null,null,null,null,null,null,null,null,null,null,null,null,null,"",null,null,null,null,null,null,null,null,null,null,0,0,"",0,0,{"$error":"#N/A"},"",0,null,null,"","",{"$error":"#N/A"}]
[null,null,22,null,null,null,null,null,null,null,null,null,null,null,null,null,null,"",null,null,null,null,null,null,null,null,null,null,null,null,null,null,null,null,0,null,null,null,null,null,null,null,null,null,null,null,null,null,null,null,null,null,null,"",null,null,null,null,null,null,null,null,null,null,0,0,"",0,0,{"$error":"#N/A"},"",0,null,null,"","",{"$error":"#N/A"}]
[null,null,23,null,null,null,null,null,null,null,null,null,null,null,null,null,null,"",null,null,null,null,null,null,null,null,null,null,null,null,null,null,null,null,0,null,null,null,null,null,null,null,null,null,null,null,null,null,null,null,null,null,null,"",null,null,null,null,null,null,null,null,null,null,0,0,"",0,0,{"$error":"#N/A"},"",0,null,null,"","",{"$error":"#N/A"}]
[null,null,24,null,null,null,null,null,null,null,null,null,null,null,null,null,null,"",null,null,null,null,null,null,null,null,null,null,null,null,null,null,null,null,0,null,null,null,null,null,null,null,null,null,null,null,null,null,null,null,null,null,null,"",null,null,null,null,null,null,null,null,null,null,0,0,"",0,0,{"$error":"#N/A"},"",0,null,null,"","",{"$error":"#N/A"}]
[null,null,25,null,null,null,null,null,null,null,null,null,null,null,null,null,null,"",null,null,null,null,null,null,null,null,null,null,null,null,null,null,null,null,0,null,null,null,null,null,null,null,null,null,null,null,null,null,null,null,null,null,null,"",null,null,null,null,null,null,null,null,null,null,0,0,"",0,0,{"$error":"#N/A"},"",0,null,null,"","",{"$error":"#N/A"}]
[null,null,26,null,null,null,null,null,null,null,null,null,null,null,null,null,null,"",null,null,null,null,null,null,null,null,null,null,null,null,null,null,null,null,0,null,null,null,null,null,null,null,null,null,null,null,null,null,null,null,null,null,null,"",null,null,null,null,null,null,null,null,null,null,0,0,"",0,0,{"$error":"#N/A"},"",0,null,null,"","",{"$error":"#N/A"}]
[null,null,27,null,null,null,null,null,null,null,null,null,null,null,null,null,null,"",null,null,null,null,null,null,null,null,null,null,null,null,null,null,null,null,0,null,null,null,null,null,null,null,null,null,null,null,null,null,null,null,null,null,null,"",null,null,null,null,null,null,null,null,null,null,0,0,"",0,0,{"$error":"#N/A"},"",0,null,null,"","",{"$error":"#N/A"}]
[null,null,28,null,null,null,null,null,null,null,null,null,null,null,null,null,null,"",null,null,null,null,null,null,null,null,null,null,null,null,null,null,null,null,0,null,null,null,null,null,null,null,null,null,null,null,null,null,null,null,null,null,null,"",null,null,null,null,null,null,null,null,null,null,0,0,"",0,0,{"$error":"#N/A"},"",0,null,null,"","",{"$error":"#N/A"}]
[null,null,29,null,null,null,null,null,null,null,null,null,null,null,null,null,null,"",null,null,null,null,null,null,null,null,null,null,null,null,null,null,null,null,0,null,null,null,null,null,null,null,null,null,null,null,null,null,null,null,null,null,null,"",null,null,null,null,null,null,null,null,null,null,0,0,"",0,0,{"$error":"#N/A"},"",0,null,null,"","",{"$error":"#N/A"}]
[null,null,30,null,null,null,null,null,null,null,null,null,null,null,null,null,null,"",null,null,null,null,null,null,null,null,null,null,null,null,null,null,null,null,0,null,null,null,null,null,null,null,null,null,null,null,null,null,null,null,null,null,null,"",null,null,null,null,null,null,null,null,null,null,0,0,"",0,0,{"$error":"#N/A"},"",0,null,null,"","",{"$error":"#N/A"}]
[null,null,31,null,null,null,null,null,null,null,null,null,null,null,null,null,null,"",null,null,null,null,null,null,null,null,null,null,null,null,null,null,null,null,0,null,null,null,null,null,null,null,null,null,null,null,null,null,null,null,null,null,null,"",null,null,null,null,null,null,null,null,null,null,0,0,"",0,0,{"$error":"#N/A"},"",0,null,null,"","",{"$error":"#N/A"}]
[null,null,32,null,null,null,null,null,null,null,null,null,null,null,null,null,null,"",null,null,null,null,null,null,null,null,null,null,null,null,null,null,null,null,0,null,null,null,null,null,null,null,null,null,null,null,null,null,null,null,null,null,null,"",null,null,null,null,null,null,null,null,null,null,0,0,"",0,0,{"$error":"#N/A"},"",0,null,null,"","",{"$error":"#N/A"}]
[null,null,33,null,null,null,null,null,null,null,null,null,null,null,null,null,null,"",null,null,null,null,null,null,null,null,null,null,null,null,null,null,null,null,0,null,null,null,null,null,null,null,null,null,null,null,null,null,null,null,null,null,null,{"$f":"IFERROR(ROUND(IF(ISBLANK(D86),\"\",IF(M86=\"Yes\",0,IF(Z86=\"Reports Only\",NGOLPSurvey*0.5,(NGOLPSurvey+Indigo)*0.5))),0),\"\")","v":""},null,null,null,null,null,null,null,null,null,null,0,0,{"$f":"IF(ISBLANK(D86),\"\",D86)","v":""},{"$f":"IF(Z86=\"Reports Only\",NGOLPSurvey,0)","v":0},{"$f":"IF(Z86=\"Indigo™\",Indigo,0)","v":0},{"$f":"AI86*MSAddOn","v":{"$error":"#N/A"}},"",0,null,null,{"$f":"IF(M86=\"Yes\",\"\",BB86)","v":""},"",{"$error":"#N/A"}]
[null,null,34,null,null,null,null,null,null,null,null,null,null,null,null,null,null,"",null,null,null,null,null,null,null,null,null,null,null,null,null,null,null,null,0,null,null,null,null,null,null,null,null,null,null,null,null,null,null,null,null,null,null,"",null,null,null,null,null,null,null,null,null,null,0,0,"",0,0,{"$error":"#N/A"},"",0,null,null,"","",{"$error":"#N/A"}]
[null,null,35,null,null,null,null,null,null,null,null,null,null,null,null,null,null,"",null,null,null,null,null,null,null,null,null,null,null,null,null,null,null,null,0,null,null,null,null,null,null,null,null,null,null,null,null,null,null,null,null,null,null,"",null,null,null,null,null,null,null,null,null,null,0,0,"",0,0,{"$error":"#N/A"},"",0,null,null,"","",{"$error":"#N/A"}]
[null,null,36,null,null,null,null,null,null,null,null,null,null,null,null,null,null,"",null,null,null,null,null,null,null,null,null,null,null,null,null,null,null,null,0,null,null,null,null,null,null,null,null,null,null,null,null,null,null,null,null,null,null,"",null,null,null,null,null,null,null,null,null,null,0,0,"",0,0,{"$error":"#N/A"},"",0,null,null,"","",{"$error":"#N/A"}]
[null,null,37,null,null,null,null,null,null,null,null,null,null,null,null,null,null,"",null,null,null,null,null,null,null,null,null,null,null,null,null,null,null,null,0,null,null,null,null,null,null,null,null,null,null,null,null,null,null,null,null,null,null,"",null,null,null,null,null,null,null,null,null,null,0,0,"",0,0,{"$error":"#N/A"},"",0,null,null,"","",{"$error":"#N/A"}]
[null,null,38,null,null,null,null,null,null,null,null,null,null,null,null,null,null,"",null,null,null,null,null,null,null,null,null,null,null,null,null,null,null,null,0,null,null,null,null,null,null,null,null,null,null,null,null,null,null,null,null,null,null,"",null,null,null,null,null,null,null,null,null,null,0,0,"",0,0,{"$error":"#N/A"},"",0,null,null,"","",{"$error":"#N/A"}]
[null,null,39,null,null,null,null,null,null,null,null,null,null,null,null,null,null,"",null,null,null,null,null,null,null,null,null,null,null,null,null,null,null,null,0,null,null,null,null,null,null,null,null,null,null,null,null,null,null,null,null,null,null,"",null,null,null,null,null,null,null,null,null,null,0,0,"",0,0,{"$error":"#N/A"},"",0,null,null,"","",{"$error":"#N/A"}]
[null,null,40,null,null,null,null,null,null,null,null,null,null,null,null,null,null,"",null,null,null,null,null,null,null,null,null,null,null,null,null,null,null,null,0,null,null,null,null,null,null,null,null,null,null,null,null,null,null,null,null,null,null,"",null,null,null,null,null,null,null,null,null,null,0,0,"",0,0,{"$error":"#N/A"},"",0,null,null,"","",{"$error":"#N/A"}]
[null,null,41,null,null,null,null,null,null,null,null,null,null,null,null,null,null,"",null,null,null,null,null,null,null,null,null,null,null,null,null,null,null,null,0,null,null,null,null,null,null,null,null,null,null,null,null,null,null,null,null,null,null,"",null,null,null,null,null,null,null,null,null,null,0,0,"",0,0,{"$error":"#N/A"},"",0,null,null,"","",{"$error":"#N/A"}]
[null,null,42,null,null,null,null,null,null,null,null,null,null,null,null,null,null,"",null,null,null,null,null,null,null,null,null,null,null,null,null,null,null,null,0,null,null,null,null,null,null,null,null,null,null,null,null,null,null,null,null,null,null,"",null,null,null,null,null,null,null,null,null,null,0,0,"",0,0,{"$error":"#N/A"},"",0,null,null,"","",{"$error":"#N/A"}]
[null,null,43,null,null,null,null,null,null,null,null,null,null,null,null,null,null,"",null,null,null,null,null,null,null,null,null,null,null,null,null,null,null,null,0,null,null,null,null,null,null,null,null,null,null,null,null,null,null,null,null,null,null,"",null,null,null,null,null,null,null,null,null,null,0,0,"",0,0,{"$error":"#N/A"},"",0,null,null,"","",{"$error":"#N/A"}]
[null,null,44,null,null,null,null,null,null,null,null,null,null,null,null,null,null,"",null,null,null,null,null,null,null,null,null,null,null,null,null,null,null,null,0,null,null,null,null,null,null,null,null,null,null,null,null,null,null,null,null,null,null,"",null,null,null,null,null,null,null,null,null,null,0,0,"",0,0,{"$error":"#N/A"},"",0,null,null,"","",{"$error":"#N/A"}]
[null,null,45,null,null,null,null,null,null,null,null,null,null,null,null,null,null,"",null,null,null,null,null,null,null,null,null,null,null,null,null,null,null,null,0,null,null,null,null,null,null,null,null,null,null,null,null,null,null,null,null,null,null,"",null,null,null,null,null,null,null,null,null,null,0,0,"",0,0,{"$error":"#N/A"},"",0,null,null,"","",{"$error":"#N/A"}]
[null,null,46,null,null,null,null,null,null,null,null,null,null,null,null,null,null,"",null,null,null,null,null,null,null,null,null,null,null,null,null,null,null,null,0,null,null,null,null,null,null,null,null,null,null,null,null,null,null,null,null,null,null,"",null,null,null,null,null,null,null,null,null,null,0,0,"",0,0,{"$error":"#N/A"},"",0,null,null,"","",{"$error":"#N/A"}]
[null,null,47,null,null,null,null,null,null,null,null,null,null,null,null,null,null,"",null,null,null,null,null,null,null,null,null,null,null,null,null,null,null,null,0,null,null,null,null,null,null,null,null,null,null,null,null,null,null,null,null,null,null,"",null,null,null,null,null,null,null,null,null,null,0,0,"",0,0,{"$error":"#N/A"},"",0,null,null,"","",{"$error":"#N/A"}]
[null,null,48,null,null,null,null,null,null,null,null,null,null,null,null,null,null,"",null,null,null,null,null,null,null,null,null,null,null,null,null,null,null,null,0,null,null,null,null,null,null,null,null,null,null,null,null,null,null,null,null,null,null,"",null,null,null,null,null,null,null,null,null,null,0,0,"",0,0,{"$error":"#N/A"},"",0,null,null,"","",{"$error":"#N/A"}]
[null,null,49,null,null,null,null,null,null,null,null,null,null,null,null,null,null,"",null,null,null,null,null,null,null,null,null,null,null,null,null,null,null,null,0,null,null,null,null,null,null,null,null,null,null,null,null,null,null,null,null,null,null,"",null,null,null,null,null,null,null,null,null,null,0,0,"",0,0,{"$error":"#N/A"},"",0,null,null,"","",{"$error":"#N/A"}]
[null,null,50,null,null,null,null,null,null,null,null,null,null,null,null,null,null,"",null,null,null,null,null,null,null,null,null,null,null,null,null,null,null,null,0,null,null,null,null,null,null,null,null,null,null,null,null,null,null,null,null,null,null,"",null,null,null,null,null,null,null,null,null,null,0,0,"",0,0,{"$error":"#N/A"},"",0,null,null,"","",{"$error":"#N/A"}]
[null,null,51,null,null,null,null,null,null,null,null,null,null,null,null,null,null,"",null,null,null,null,null,null,null,null,null,null,null,null,null,null,null,null,0,null,null,null,null,null,null,null,null,null,null,null,null,null,null,null,null,null,null,"",null,null,null,null,null,null,null,null,null,null,0,0,"",0,0,{"$error":"#N/A"},"",0,null,null,"","",{"$error":"#N/A"}]
[null,null,52,null,null,null,null,null,null,null,null,null,null,null,null,null,null,"",null,null,null,null,null,null,null,null,null,null,null,null,null,null,null,null,0,null,null,null,null,null,null,null,null,null,null,null,null,null,null,null,null,null,null,"",null,null,null,null,null,null,null,null,null,null,0,0,"",0,0,{"$error":"#N/A"},"",0,null,null,"","",{"$error":"#N/A"}]
[null,null,53,null,null,null,null,null,null,null,null,null,null,null,null,null,null,"",null,null,null,null,null,null,null,null,null,null,null,null,null,null,null,null,0,null,null,null,null,null,null,null,null,null,null,null,null,null,null,null,null,null,null,"",null,null,null,null,null,null,null,null,null,null,0,0,"",0,0,{"$error":"#N/A"},"",0,null,null,"","",{"$error":"#N/A"}]
[null,null,54,null,null,null,null,null,null,null,null,null,null,null,null,null,null,"",null,null,null,null,null,null,null,null,null,null,null,null,null,null,null,null,0,null,null,null,null,null,null,null,null,null,null,null,null,null,null,null,null,null,null,"",null,null,null,null,null,null,null,null,null,null,0,0,"",0,0,{"$error":"#N/A"},"",0,null,null,"","",{"$error":"#N/A"}]
[null,null,55,null,null,null,null,null,null,null,null,null,null,null,null,null,null,"",null,null,null,null,null,null,null,null,null,null,null,null,null,null,null,null,0,null,null,null,null,null,null,null,null,null,null,null,null,null,null,null,null,null,null,"",null,null,null,null,null,null,null,null,null,null,0,0,"",0,0,{"$error":"#N/A"},"",0,null,null,"","",{"$error":"#N/A"}]
[null,null,56,null,null,null,null,null,null,null,null,null,null,null,null,null,null,"",null,null,null,null,null,null,null,null,null,null,null,null,null,null,null,null,0,null,null,null,null,null,null,null,null,null,null,null,null,null,null,null,null,null,null,"",null,null,null,null,null,null,null,null,null,null,0,0,"",0,0,{"$error":"#N/A"},"",0,null,null,"","",{"$error":"#N/A"}]
[null,null,57,null,null,null,null,null,null,null,null,null,null,null,null,null,null,"",null,null,null,null,null,null,null,null,null,null,null,null,null,null,null,null,0,null,null,null,null,null,null,null,null,null,null,null,null,null,null,null,null,null,null,"",null,null,null,null,null,null,null,null,null,null,0,0,"",0,0,{"$error":"#N/A"},"",0,null,null,"","",{"$error":"#N/A"}]
[null,null,58,null,null,null,null,null,null,null,null,null,null,null,null,null,null,"",null,null,null,null,null,null,null,null,null,null,null,null,null,null,null,null,0,null,null,null,null,null,null,null,null,null,null,null,null,null,null,null,null,null,null,"",null,null,null,null,null,null,null,null,null,null,0,0,"",0,0,{"$error":"#N/A"},"",0,null,null,"","",{"$error":"#N/A"}]
[null,null,59,null,null,null,null,null,null,null,null,null,null,null,null,null,null,"",null,null,null,null,null,null,null,null,null,null,null,null,null,null,null,null,0,null,null,null,null,null,null,null,null,null,null,null,null,null,null,null,null,null,null,"",null,null,null,null,null,null,null,null,null,null,0,0,"",0,0,{"$error":"#N/A"},"",0,null,null,"","",{"$error":"#N/A"}]
[null,null,60,null,null,null,null,null,null,null,null,null,null,null,null,null,null,"",null,null,null,null,null,null,null,null,null,null,null,null,null,null,null,null,0,null,null,null,null,null,null,null,null,null,null,null,null,null,null,null,null,null,null,"",null,null,null,null,null,null,null,null,null,null,0,0,"",0,0,{"$error":"#N/A"},"",0,null,null,"","",{"$error":"#N/A"}]
[null,null,"GP","NGO Global Pay",null,null,null,null,null,null,null,null,{"$f":"IF(NGOGPChoice=\"No\",\"\",IF(NGOGPChoice=\"Yes (Participant)\", \"Yes\",\"No\"))","v":""},null,null,null,null,null,null,null,null,null,null,null,null,null,null,null,null,null,null,null,null,null,null,null,null,null,null,null,null,null,null,null,{"$f":"IF(NGOGPChoice=\"Yes (Participant)\", NGOGlobalPayFee,IF(NGOGPChoice=\"Yes (Non-Participant)\",NGOGlobalPayFee,\"\"))","v":""},null,null,null,null,null,null,null,null,{"$f":"IF(ISBLANK(M114),0,IF(M114=\"Yes\",0,NGOGlobalPayFee*0.5))","v":0}]
[null,null,null,null,null,null,null,null,null,null,null,null,null,null,null,null,null,null,null,null,null,null,null,null,null,null,null,null,null,null,null,null,null,null,null,null,null,null,null,null,null,null,null,null,null,null,null,null,null,null,null,null,null,null,null,null,null,null,null,null,null,null,null,null,{"$f":"OrgName","v":0},{"$f":"OrderNumber","v":0},{"$f":"TotalIndigo","v":0},{"$f":"SUM(BP54:BP113)","v":0},{"$f":"SUM(BQ54:BQ113)","v":0},{"$f":"SUM(BR54:BR113)","v":{"$error":"#N/A"}},null,{"$f":"SUM(BT54:BT113)","v":0},null,{"$f":"SUM(BV54:BV113)","v":0},{"$f":"SUM(BW54:BW113)","v":0},{"$f":"SUM(BX54:BX113)","v":0},{"$f":"SUM(BY54:BY113)","v":{"$error":"#N/A"}}]
[null,null,null,null,null,null,null,null,null,null,null,null,"Total",null,null,null,null,"Report Subscriptions",null,null,null,null,null,null,null,"Indigo™ Subscriptions",null,null,null,null,"Multsector\nAdd-on",null,null,null,null,null,null,null,null,null,null,null,null,null,"NGO Global Pay",null,null,null,null,null,null,null,"Expedited Reports","Non-Particiption Fee"]
[null,null,null,null,null,null,"Total",null,null,null,null,{"$f":"ROUND(SUM(R117:BF117),0)","v":{"$error":"#N/A"}},null,null,null,null,null,{"$f":"NGOLPSurvey*COUNTIF($Z54:$AD113,\"=Reports Only\")","v":{"$error":"#N/A"}},null,null,null,null,null,null,null,{"$f":"Indigo*COUNTIF($Z54:$AD113,\"=Indigo™\")","v":{"$error":"#N/A"}},null,null,null,null,{"$f":"MSAddOn*SUM(AI54:AI113)","v":{"$error":"#N/A"}},null,null,null,null,null,null,null,null,null,null,null,null,null,{"$f":"NGOGlobalPayFee","v":0},null,null,null,null,null,null,null,{"$f":"Expedited*COUNTIF(BA54:BA113,\"Yes\")","v":0},{"$f":"SUM(BB54:BF114)","v":0}]
[]
[null,null,null,null,"Note:  All fees are net of tax.  If any  income tax, withholding tax, VAT or similar taxes are payable, the invoice amount will be"]
[null,null,null,null,"increased (grossed-up) and taxes will be withheld from the resulting balance."]
[]
[null,null,null,null,{"$f":"\"Tax rate applicable in \"&IF(AF36=\"\",AF24,AF36)&\":\"","v":"Tax rate applicable in :"},null,null,null,null,null,null,null,null,null,null,null,null,null,null,null,{"$f":"_xlfn.IFNA(VLOOKUP(IF(AF36=\"\",AF24,AF36),GrossUps,2,FALSE)*IF(AB122=\"\",1,0),\"Not Applicable\")","v":"Not Applicable"},null,null,null,null,null,null,null,null,null,"Type X to cancel application of tax"]
[null,null,null,null,"Tax Gross-up Amount:",null,null,null,null,null,null,null,null,null,null,null,null,null,null,null,{"$f":"IF(U122=\"Not Applicable\",0,ROUND((L117/(1-U122))-L117,2))","v":0}]
[]
[]
[]
[null,null,"Subscription Agreement"]
[null,null,"All data is sold via subscription for a 12-month period, beginning on the Subscription Start Date you entered on the first Order Form Page"]
[null,null,"Three survey updates are issued annually, in April, July and October.  Participants must contribute their organization's data once "]
[null,null,"  per year, within 60 days following annual pay review, or be subject to a non-participant surcharge (see Subscription Agreement, paragraph 18)."]
[]
[null,null,"All subscriptions require confirmation of Terms and Conditions via our Subscription Agreement.  "]
[]
[null,null,"Click HERE to review the terms and conditions and confirm your agreement."]
[null,null,null,null,null,null,null,null,null,null,null,null,null,null,null,null,false]
[null,null,{"$f":"IF('Subscription Agreement'!$C$81=TRUE,\"Agreement Confirmed\",\"Agreement NOT Confirmed\")","v":"Agreement NOT Confirmed"}]
[]
[null,null,"Notes / Special Billing Requests"]
[]
[]
[]
[]
[]
[]
[]
[]
[null,null,null,"Country Information"]
[null,null,null,"Please indicate below, for each country in which you registered, the requested information.\nClick on the column header for further help."]
[null,null,null,"When finished, click on Go to Survey Access to continue."]
[null,null,null,null,{"$f":"COLUMN(E150)-4","v":1},null,null,null,null,null,null,null,null,{"$f":"COLUMN(N150)-4","v":10},null,null,null,null,null,null,null,null,{"$f":"COLUMN(W150)-4","v":19},null,null,null,null,null,null,null,null,{"$f":"COLUMN(AF150)-4","v":28}]
[null,null,null,null,null,null,null,null,null,null,null,null,null,null,null,null,null,null,null,null,null,null,null,null,null,null,null,null,null,null,null,"Pay Review Frequency",null,null,null,null,null,null,null,null,"Data Submission Month",null,null,null,null,null,null,null,null,"Data Submission Cycle"]
[null,null,null,null,"Survey Country",null,null,null,null,null,null,null,null,"Total Staff Count",null,null,null,null,null,null,null,null,"Next Pay Review Date"]
[null,null,null,null,null,null,null,null,null,null,null,null,null,null,null,null,null,null,null,null,null,null,null,null,null,null,null,null,null,null,null,null,null,null,null,null,null,null,null,null,null,null,null,null,null,null,null,null,null,{"$f":"IFERROR(VLOOKUP(AO153,DataCycles,2,FALSE),\"\")","v":""}]
[null,null,null,null,null,null,null,null,null,null,null,null,null,null,null,null,null,null,null,null,null,null,null,null,null,null,null,null,null,null,null,null,null,null,null,null,null,null,null,null,null,null,null,null,null,null,null,null,null,""]
[null,null,null,null,null,null,null,null,null,null,null,null,null,null,null,null,null,null,null,null,null,null,null,null,null,null,null,null,null,null,null,null,null,null,null,null,null,null,null,null,null,null,null,null,null,null,null,null,null,""]
[null,null,null,null,null,null,null,null,null,null,null,null,null,null,null,null,null,null,null,null,null,null,null,null,null,null,null,null,null,null,null,null,null,null,null,null,null,null,null,null,null,null,null,null,null,null,null,null,null,""]
[null,null,null,null,null,null,null,null,null,null,null,null,null,null,null,null,null,null,null,null,null,null,null,null,null,null,null,null,null,null,null,null,null,null,null,null,null,null,null,null,null,null,null,null,null,null,null,null,null,""]
[null,null,null,null,null,null,null,null,null,null,null,null,null,null,null,null,null,null,null,null,null,null,null,null,null,null,null,null,null,null,null,null,null,null,null,null,null,null,null,null,null,null,null,null,null,null,null,null,null,""]
[null,null,null,null,null,null,null,null,null,null,null,null,null,null,null,null,null,null,null,null,null,null,null,null,null,null,null,null,null,null,null,null,null,null,null,null,null,null,null,null,null,null,null,null,null,null,null,null,null,""]
[null,null,null,null,null,null,null,null,null,null,null,null,null,null,null,null,null,null,null,null,null,null,null,null,null,null,null,null,null,null,null,null,null,null,null,null,null,null,null,null,null,null,null,null,null,null,null,null,null,""]
[null,null,null,null,null,null,null,null,null,null,null,null,null,null,null,null,null,null,null,null,null,null,null,null,null,null,null,null,null,null,null,null,null,null,null,null,null,null,null,null,null,null,null,null,null,null,null,null,null,""]
[null,null,null,null,null,null,null,null,null,null,null,null,null,null,null,null,null,null,null,null,null,null,null,null,null,null,null,null,null,null,null,null,null,null,null,null,null,null,null,null,null,null,null,null,null,null,null,null,null,""]
[null,null,null,null,null,null,null,null,null,null,null,null,null,null,null,null,null,null,null,null,null,null,null,null,null,null,null,null,null,null,null,null,null,null,null,null,null,null,null,null,null,null,null,null,null,null,null,null,null,""]
[null,null,null,null,null,null,null,null,null,null,null,null,null,null,null,null,null,null,null,null,null,null,null,null,null,null,null,null,null,null,null,null,null,null,null,null,null,null,null,null,null,null,null,null,null,null,null,null,null,""]
[null,null,null,null,null,null,null,null,null,null,null,null,null,null,null,null,null,null,null,null,null,null,null,null,null,null,null,null,null,null,null,null,null,null,null,null,null,null,null,null,null,null,null,null,null,null,null,null,null,""]
[null,null,null,null,null,null,null,null,null,null,null,null,null,null,null,null,null,null,null,null,null,null,null,null,null,null,null,null,null,null,null,null,null,null,null,null,null,null,null,null,null,null,null,null,null,null,null,null,null,""]
[null,null,null,null,null,null,null,null,null,null,null,null,null,null,null,null,null,null,null,null,null,null,null,null,null,null,null,null,null,null,null,null,null,null,null,null,null,null,null,null,null,null,null,null,null,null,null,null,null,""]
[null,null,null,null,null,null,null,null,null,null,null,null,null,null,null,null,null,null,null,null,null,null,null,null,null,null,null,null,null,null,null,null,null,null,null,null,null,null,null,null,null,null,null,null,null,null,null,null,null,""]
[null,null,null,null,null,null,null,null,null,null,null,null,null,null,null,null,null,null,null,null,null,null,null,null,null,null,null,null,null,null,null,null,null,null,null,null,null,null,null,null,null,null,null,null,null,null,null,null,null,""]
[null,null,null,null,null,null,null,null,null,null,null,null,null,null,null,null,null,null,null,null,null,null,null,null,null,null,null,null,null,null,null,null,null,null,null,null,null,null,null,null,null,null,null,null,null,null,null,null,null,""]
[null,null,null,null,null,null,null,null,null,null,null,null,null,null,null,null,null,null,null,null,null,null,null,null,null,null,null,null,null,null,null,null,null,null,null,null,null,null,null,null,null,null,null,null,null,null,null,null,null,""]
[null,null,null,null,null,null,null,null,null,null,null,null,null,null,null,null,null,null,null,null,null,null,null,null,null,null,null,null,null,null,null,null,null,null,null,null,null,null,null,null,null,null,null,null,null,null,null,null,null,""]
[null,null,null,null,null,null,null,null,null,null,null,null,null,null,null,null,null,null,null,null,null,null,null,null,null,null,null,null,null,null,null,null,null,null,null,null,null,null,null,null,null,null,null,null,null,null,null,null,null,""]
[null,null,null,null,null,null,null,null,null,null,null,null,null,null,null,null,null,null,null,null,null,null,null,null,null,null,null,null,null,null,null,null,null,null,null,null,null,null,null,null,null,null,null,null,null,null,null,null,null,""]
[null,null,null,null,null,null,null,null,null,null,null,null,null,null,null,null,null,null,null,null,null,null,null,null,null,null,null,null,null,null,null,null,null,null,null,null,null,null,null,null,null,null,null,null,null,null,null,null,null,""]
[null,null,null,null,null,null,null,null,null,null,null,null,null,null,null,null,null,null,null,null,null,null,null,null,null,null,null,null,null,null,null,null,null,null,null,null,null,null,null,null,null,null,null,null,null,null,null,null,null,""]
[null,null,null,null,null,null,null,null,null,null,null,null,null,null,null,null,null,null,null,null,null,null,null,null,null,null,null,null,null,null,null,null,null,null,null,null,null,null,null,null,null,null,null,null,null,null,null,null,null,""]
[null,null,null,null,null,null,null,null,null,null,null,null,null,null,null,null,null,null,null,null,null,null,null,null,null,null,null,null,null,null,null,null,null,null,null,null,null,null,null,null,null,null,null,null,null,null,null,null,null,""]
[null,null,null,null,null,null,null,null,null,null,null,null,null,null,null,null,null,null,null,null,null,null,null,null,null,null,null,null,null,null,null,null,null,null,null,null,null,null,null,null,null,null,null,null,null,null,null,null,null,""]
[null,null,null,null,null,null,null,null,null,null,null,null,null,null,null,null,null,null,null,null,null,null,null,null,null,null,null,null,null,null,null,null,null,null,null,null,null,null,null,null,null,null,null,null,null,null,null,null,null,""]
[null,null,null,null,null,null,null,null,null,null,null,null,null,null,null,null,null,null,null,null,null,null,null,null,null,null,null,null,null,null,null,null,null,null,null,null,null,null,null,null,null,null,null,null,null,null,null,null,null,""]
[null,null,null,null,null,null,null,null,null,null,null,null,null,null,null,null,null,null,null,null,null,null,null,null,null,null,null,null,null,null,null,null,null,null,null,null,null,null,null,null,null,null,null,null,null,null,null,null,null,""]
[null,null,null,null,null,null,null,null,null,null,null,null,null,null,null,null,null,null,null,null,null,null,null,null,null,null,null,null,null,null,null,null,null,null,null,null,null,null,null,null,null,null,null,null,null,null,null,null,null,""]
[null,null,null,null,null,null,null,null,null,null,null,null,null,null,null,null,null,null,null,null,null,null,null,null,null,null,null,null,null,null,null,null,null,null,null,null,null,null,null,null,null,null,null,null,null,null,null,null,null,""]
[null,null,null,null,null,null,null,null,null,null,null,null,null,null,null,null,null,null,null,null,null,null,null,null,null,null,null,null,null,null,null,null,null,null,null,null,null,null,null,null,null,null,null,null,null,null,null,null,null,""]
[null,null,null,null,null,null,null,null,null,null,null,null,null,null,null,null,null,null,null,null,null,null,null,null,null,null,null,null,null,null,null,null,null,null,null,null,null,null,null,null,null,null,null,null,null,null,null,null,null,""]
[null,null,null,null,null,null,null,null,null,null,null,null,null,null,null,null,null,null,null,null,null,null,null,null,null,null,null,null,null,null,null,null,null,null,null,null,null,null,null,null,null,null,null,null,null,null,null,null,null,""]
[null,null,null,null,null,null,null,null,null,null,null,null,null,null,null,null,null,null,null,null,null,null,null,null,null,null,null,null,null,null,null,null,null,null,null,null,null,null,null,null,null,null,null,null,null,null,null,null,null,""]
[null,null,null,null,null,null,null,null,null,null,null,null,null,null,null,null,null,null,null,null,null,null,null,null,null,null,null,null,null,null,null,null,null,null,null,null,null,null,null,null,null,null,null,null,null,null,null,null,null,""]
[null,null,null,null,null,null,null,null,null,null,null,null,null,null,null,null,null,null,null,null,null,null,null,null,null,null,null,null,null,null,null,null,null,null,null,null,null,null,null,null,null,null,null,null,null,null,null,null,null,""]
[null,null,null,null,null,null,null,null,null,null,null,null,null,null,null,null,null,null,null,null,null,null,null,null,null,null,null,null,null,null,null,null,null,null,null,null,null,null,null,null,null,null,null,null,null,null,null,null,null,""]
[null,null,null,null,null,null,null,null,null,null,null,null,null,null,null,null,null,null,null,null,null,null,null,null,null,null,null,null,null,null,null,null,null,null,null,null,null,null,null,null,null,null,null,null,null,null,null,null,null,""]
[null,null,null,null,null,null,null,null,null,null,null,null,null,null,null,null,null,null,null,null,null,null,null,null,null,null,null,null,null,null,null,null,null,null,null,null,null,null,null,null,null,null,null,null,null,null,null,null,null,""]
[null,null,null,null,null,null,null,null,null,null,null,null,null,null,null,null,null,null,null,null,null,null,null,null,null,null,null,null,null,null,null,null,null,null,null,null,null,null,null,null,null,null,null,null,null,null,null,null,null,""]
[null,null,null,null,null,null,null,null,null,null,null,null,null,null,null,null,null,null,null,null,null,null,null,null,null,null,null,null,null,null,null,null,null,null,null,null,null,null,null,null,null,null,null,null,null,null,null,null,null,""]
[null,null,null,null,null,null,null,null,null,null,null,null,null,null,null,null,null,null,null,null,null,null,null,null,null,null,null,null,null,null,null,null,null,null,null,null,null,null,null,null,null,null,null,null,null,null,null,null,null,""]
[null,null,null,null,null,null,null,null,null,null,null,null,null,null,null,null,null,null,null,null,null,null,null,null,null,null,null,null,null,null,null,null,null,null,null,null,null,null,null,null,null,null,null,null,null,null,null,null,null,""]
[null,null,null,null,null,null,null,null,null,null,null,null,null,null,null,null,null,null,null,null,null,null,null,null,null,null,null,null,null,null,null,null,null,null,null,null,null,null,null,null,null,null,null,null,null,null,null,null,null,""]
[null,null,null,null,null,null,null,null,null,null,null,null,null,null,null,null,null,null,null,null,null,null,null,null,null,null,null,null,null,null,null,null,null,null,null,null,null,null,null,null,null,null,null,null,null,null,null,null,null,""]
[null,null,null,null,null,null,null,null,null,null,null,null,null,null,null,null,null,null,null,null,null,null,null,null,null,null,null,null,null,null,null,null,null,null,null,null,null,null,null,null,null,null,null,null,null,null,null,null,null,""]
[null,null,null,null,null,null,null,null,null,null,null,null,null,null,null,null,null,null,null,null,null,null,null,null,null,null,null,null,null,null,null,null,null,null,null,null,null,null,null,null,null,null,null,null,null,null,null,null,null,""]
[null,null,null,null,null,null,null,null,null,null,null,null,null,null,null,null,null,null,null,null,null,null,null,null,null,null,null,null,null,null,null,null,null,null,null,null,null,null,null,null,null,null,null,null,null,null,null,null,null,""]
[null,null,null,null,null,null,null,null,null,null,null,null,null,null,null,null,null,null,null,null,null,null,null,null,null,null,null,null,null,null,null,null,null,null,null,null,null,null,null,null,null,null,null,null,null,null,null,null,null,""]
[null,null,null,null,null,null,null,null,null,null,null,null,null,null,null,null,null,null,null,null,null,null,null,null,null,null,null,null,null,null,null,null,null,null,null,null,null,null,null,null,null,null,null,null,null,null,null,null,null,""]
[null,null,null,null,null,null,null,null,null,null,null,null,null,null,null,null,null,null,null,null,null,null,null,null,null,null,null,null,null,null,null,null,null,null,null,null,null,null,null,null,null,null,null,null,null,null,null,null,null,""]
[null,null,null,null,null,null,null,null,null,null,null,null,null,null,null,null,null,null,null,null,null,null,null,null,null,null,null,null,null,null,null,null,null,null,null,null,null,null,null,null,null,null,null,null,null,null,null,null,null,""]
[null,null,null,null,null,null,null,null,null,null,null,null,null,null,null,null,null,null,null,null,null,null,null,null,null,null,null,null,null,null,null,null,null,null,null,null,null,null,null,null,null,null,null,null,null,null,null,null,null,""]
[null,null,null,null,null,null,null,null,null,null,null,null,null,null,null,null,null,null,null,null,null,null,null,null,null,null,null,null,null,null,null,null,null,null,null,null,null,null,null,null,null,null,null,null,null,null,null,null,null,""]
[null,null,null,null,null,null,null,null,null,null,null,null,null,null,null,null,null,null,null,null,null,null,null,null,null,null,null,null,null,null,null,null,null,null,null,null,null,null,null,null,null,null,null,null,null,null,null,null,null,""]
[null,null,null,null,null,null,null,null,null,null,null,null,null,null,null,null,null,null,null,null,null,null,null,null,null,null,null,null,null,null,null,null,null,null,null,null,null,null,null,null,null,null,null,null,null,null,null,null,null,""]
[null,null,null,null,null,null,null,null,null,null,null,null,null,null,null,null,null,null,null,null,null,null,null,null,null,null,null,null,null,null,null,null,null,null,null,null,null,null,null,null,null,null,null,null,null,null,null,null,null,""]
[null,null,null,null,null,null,null,null,null,null,null,null,null,null,null,null,null,null,null,null,null,null,null,null,null,null,null,null,null,null,null,null,null,null,null,null,null,null,null,null,null,null,null,null,null,null,null,null,null,""]
[]
[]
[null,null,"RETURN COMPLETED FORM TO REGISTRATION@NGOLOCALPAY.NET"]
[]
[]
[null,null,null,null,"Then, send an email to:",null,null,null,null,null,null,null,null,null,"registration@birchesgroup.com",null,null,null,null,null,null,null,null,null,null,null,null,"and ATTACH THIS FILE to your email."]
[]
[]
[null,null,"© 2013 Birches Group LLC"]

{"sheet":"Country Selection","index":8,"n_rows":212,"n_cols":8,"rows_kept":212,"cut":false,"hidden":false,"merged":[[3,0,3,4],[1,226,1,233],[1,234,1,241],[2,0,2,3],[188,2,189,2],[184,1,184,3],[1,178,1,185],[1,186,1,193],[1,194,1,201],[1,202,1,209],[1,210,1,217],[1,218,1,225],[1,130,1,137],[1,138,1,145],[1,146,1,153],[1,154,1,161],[1,162,1,169],[1,170,1,177],[1,82,1,89],[1,90,1,97],[1,98,1,105],[1,106,1,113],[1,114,1,121],[1,122,1,129],[1,74,1,81],[1,0,1,3],[1,42,1,49],[1,50,1,57],[1,58,1,65],[1,66,1,73]]}
[]
["Birches Group Surveys"]
["Country Selection Form",null,null,null,"Total Countries",{"$f":"COUNTIF(D8:D180,\"=x\")","v":0}]
["Please type an X in the boxes corresponding to your NGO Local Pay survey choices in column D below, and enter your selection for NGO Global Pay in F6"]
[null,null,null,null,null,"NGO Global Pay Selection",null,"After completing ALL of your selections, press SUMBIT above"]
["Do you wish to include the NGO Global Pay Survey in your subscription?",null,null,null,null,"No"]
[null,"Region","Country","Type x to Select"]
[null,"Asia","Afghanistan"]
[null,"Europe","Albania"]
[null,"Africa","Algeria"]
[null,"Africa","Angola"]
[null,"Americas","Argentina"]
[null,"Asia","Armenia"]
[null,"Asia","Azerbaijan"]
[null,"Americas","Bahamas"]
[null,"Asia","Bahrain"]
[null,"Asia","Bangladesh"]
[null,"Americas","Barbados"]
[null,"Europe","Belarus"]
[null,"Americas","Belize"]
[null,"Europe","Belgium"]
[null,"Africa","Benin"]
[null,"Americas","Bermuda"]
[null,"Asia","Bhutan"]
[null,"Americas","Bolivia"]
[null,"Europe","Bosnia and Herzegovina"]
[null,"Africa","Botswana"]
[null,"Americas","Brazil"]
[null,"Americas","British Virgin Islands"]
[null,"Asia","Brunei"]
[null,"Europe","Bulgaria"]
[null,"Africa","Burkina Faso"]
[null,"Africa","Burundi"]
[null,"Asia","Cambodia"]
[null,"Africa","Cameroon"]
[null,"Americas","Canada"]
[null,"Africa","Cape Verde"]
[null,"Africa","Central African Republic"]
[null,"Africa","Chad"]
[null,"Americas","Chile"]
[null,"Asia","China"]
[null,"Americas","Colombia"]
[null,"Africa","Comoros"]
[null,"Africa","Congo, DR"]
[null,"Africa","Congo, Republic of the"]
[null,"Americas","Costa Rica"]
[null,"Africa","Cote D'Ivoire"]
[null,"Europe","Croatia"]
[null,"Americas","Cuba"]
[null,"Americas","Curaçao"]
[null,"Africa","Djibouti"]
[null,"Americas","Dominican Republic"]
[null,"Americas","Ecuador"]
[null,"Africa","Egypt"]
[null,"Americas","El Salvador"]
[null,"Africa","Equatorial Guinea"]
[null,"Africa","Eritrea"]
[null,"Europe","Estonia"]
[null,"Africa","Ethiopia"]
[null,"Oceania","Fiji"]
[null,"Africa","Gabon"]
[null,"Africa","Gambia"]
[null,"Asia","Georgia"]
[null,"Africa","Ghana"]
[null,"Europe","Greece"]
[null,"Americas","Grenada"]
[null,"Americas","Guatemala"]
[null,"Africa","Guinea"]
[null,"Africa","Guinea-Bissau"]
[null,"Americas","Guyana"]
[null,"Americas","Haiti"]
[null,"Americas","Honduras"]
[null,"Asia","Hong Kong"]
[null,"Asia","India"]
[null,"Asia","Indonesia"]
[null,"Asia","Iran"]
[null,"Asia","Iraq (Baghdad)"]
[null,"Asia","Iraq (Erbil)"]
[null,"Asia","Israel"]
[null,"Americas","Jamaica"]
[null,"Asia","Jordan"]
[null,"Asia","Kazakhstan"]
[null,"Africa","Kenya"]
[null,"Asia","Kiribati"]
[null,"Europe","Kosovo"]
[null,"Asia","Kuwait"]
[null,"Asia","Kyrgyzstan"]
[null,"Asia","Laos"]
[null,"Europe","Latvia"]
[null,"Asia","Lebanon"]
[null,"Africa","Lesotho"]
[null,"Africa","Liberia"]
[null,"Africa","Libya"]
[null,"Europe","Lithuania"]
[null,"Africa","Madagascar"]
[null,"Africa","Malawi"]
[null,"Asia","Malaysia"]
[null,"Asia","Maldives"]
[null,"Africa","Mali"]
[null,"Europe","Malta"]
[null,"Oceania","Marshall Islands"]
[null,"Africa","Mauritania"]
[null,"Africa","Mauritius"]
[null,"Americas","Mexico"]
[null,"Oceania","Micronesia, Federated States of"]
[null,"Europe","Moldova"]
[null,"Asia","Mongolia"]
[null,"Europe","Montenegro"]
[null,"Africa","Morocco"]
[null,"Africa","Mozambique"]
[null,"Asia","Myanmar"]
[null,"Africa","Namibia"]
[null,"Asia","Nepal"]
[null,"Europe","Netherlands"]
[null,"Americas","Nicaragua"]
[null,"Africa","Niger"]
[null,"Africa","Nigeria"]
[null,"Europe","North Macedonia"]
[null,"Asia","OPT (East Jerusalem)"]
[null,"Asia","OPT (Gaza City)"]
[null,"Asia","OPT (Ramallah)"]
[null,"Asia","Oman"]
[null,"Asia","Pakistan"]
[null,"Oceania","Palau"]
[null,"Americas","Panama"]
[null,"Oceania","Papua New Guinea"]
[null,"Americas","Paraguay"]
[null,"Americas","Peru"]
[null,"Asia","Philippines"]
[null,"Europe","Poland"]
[null,"Asia","Qatar"]
[null,"Europe","Romania"]
[null,"Europe","Russia"]
[null,"Africa","Rwanda"]
[null,"Oceania","Samoa"]
[null,"Africa","Sao Tome & Principe"]
[null,"Asia","Saudi Arabia"]
[null,"Africa","Senegal"]
[null,"Europe","Serbia"]
[null,"Africa","Seychelles"]
[null,"Africa","Sierra Leone"]
[null,"Asia","Singapore"]
[null,"Americas","Sint Maarten"]
[null,"Europe","Slovakia"]
[null,"Oceania","Solomon Islands"]
[null,"Africa","Somalia"]
[null,"Africa","Somaliland"]
[null,"Africa","South Africa"]
[null,"Asia","South Korea"]
[null,"Africa","South Sudan"]
[null,"Europe","Spain"]
[null,"Asia","Sri Lanka"]
[null,"Africa","Sudan"]
[null,"Americas","Suriname"]
[null,"Africa","Swaziland"]
[null,"Europe","Switzerland"]
[null,"Asia","Syria"]
[null,"Asia","Tajikistan"]
[null,"Africa","Tanzania"]
[null,"Asia","Thailand"]
[null,"Asia","Timor-Leste"]
[null,"Africa","Togo"]
[null,"Oceania","Tonga"]
[null,"Americas","Trinidad and Tobago"]
[null,"Africa","Tunisia"]
[null,"Asia","Turkey"]
[null,"Asia","Turkmenistan"]
[null,"Africa","Uganda"]
[null,"Europe","Ukraine"]
[null,"Asia","United Arab Emirates"]
[null,"Europe","United Kingdom"]
[null,"Americas","United States"]
[null,"Americas","Uruguay"]
[null,"Asia","Uzbekistan"]
[null,"Oceania","Vanuatu"]
[null,"Americas","Venezuela"]
[null,"Asia","Vietnam"]
[null,"Asia","Yemen"]
[null,"Africa","Zambia"]
[null,"Africa","Zimbabwe"]
[null,null,""]
[]
[null,null,""]
[]
[null,"After selecting your countrie(s), press SUBMIT above to continue"]
[null,null,""]
[null,null,""]
[null,null,""]
[null,null,""]
[]
[null,null,""]
[null,null,""]
[null,null,""]
[null,null,""]
[null,null,""]
[null,null,""]
[null,null,""]
[null,null,""]
[null,null,""]
[null,null,""]
[null,null,""]
[null,null,""]
[null,null,""]
[null,null,""]
[null,null,""]
[null,null,""]
[null,null,""]
[null,null,""]
[null,null,""]
[null,null,""]
[null,null,""]
[null,null,""]

{"sheet":"Subscription Agreement","index":9,"n_rows":81,"n_cols":3,"rows_kept":81,"cut":false,"hidden":false,"merged":[[21,1,21,2],[0,1,0,2],[1,1,1,2],[3,1,3,2],[5,1,5,2],[7,1,7,2],[9,1,9,2],[11,1,11,2],[13,1,13,2],[15,1,15,2],[17,1,17,2],[19,1,19,2],[39,1,39,2],[23,1,23,2],[25,1,25,2],[27,1,27,2],[31,1,31,2],[33,1,33,2],[35,1,35,2],[37,1,37,2],[29,1,29,2]]}
[null,"SUBSCRIPTION AGREEMENT"]
[null,"The Terms and Conditions of participation and access to Birches Group surveys are listed in the Subscription Agreement below.  \nKindly indicate your acceptance of the Agreement by checking the appropriate box at the end of the Agreement."]
[null,"1.  Parties","This Subscription Agreement (“Agreement”) is made between Birches Group, LLC, a limited liability company registered in the state of New York of the United States of America (“Service Provider” or “Birches Group”) and , the subscriber named on the Order Form page of this document."]
[]
[null,"2.  Definition of \"Subscriber\"","“Subscriber” means the subscriber company or organization indicated above, including all individuals who are provided UserIDs and passwords under the Subscriber’s account(s)."]
[]
[null,"3.  Service Provider Content","“Service Provider Content” means all information, data, materials, products and services that Service Provider provides to Subscriber or makes available to Subscriber through a paid subscription, including but not limited to: all Labor Market Data, computer software and any related technology, idea or information contained therein, software upgrades, online or electronic documentation, associated media, and printed materials."]
[]
[null,"4.  Proprietary Rights","Service Provider is the owner of all right, title, and interest in and to the Service Provider Content, including copyright, trademark, trade dress (including information formats), translation rights, redistribution rights, and the right to reproduce the Service Provider Content in alternate media. The Service Provider Content is subject to copyright, trademark, trade dress (including information formats and “look and feel”) and database protections and other rights of Service Provider under the laws of the United States and foreign jurisdictions. Subscriber acknowledges that Subscriber has no claim to ownership in such Service Provider Content by reason of this Agreement or the use of the Service Provider Content."]
[]
[null,"5.  License Grant","Subject to Subscriber’s continued compliance with this Agreement and in consideration for the fee paid or to be paid by Subscriber, Service Provider grants Subscriber a non-exclusive, personal, revocable, nontransferable license to access and use the Service Provider Content."]
[]
[null,"6.  Confidential Information","The parties recognize that they may come in contact with or become familiar with information which the Subscriber or the Service Provider may consider confidential. This information may include, but is not limited to, information pertaining to the Subscriber or Service Provider which may be of value to a competitor. Subscriber and Service Provider agree to keep all such information confidential and not to discuss or divulge it to any third party except that Service Provider may include Subscriber’s compensation data in Service Provider’s general labour market reports in such a manner that the data is not specifically attributed to Subscriber. The Parties recognize that it is customary to provide such general labour market reports as feedback to other participants in a salary survey. Subscriber acknowledges that the Service Provider Content contains proprietary and confidential property of the Birches Group (collectively, “Confidential Information”)."]
[]
[null,"7.  Conditions of Use","a. The Service Provider Content shall be used only by Subscriber solely for Subscriber’s internal business purposes and is not to be republished or distributed (either in hard copy or electronic form) in whole or in part to any third party for use by any party other than the Subscriber.\n\nb. Subscriber shall only direct questions regarding the Service Provider Content to the Birches Group. Subscriber will not contact any entity external to the Birches Group concerning the Service Provider Content or relating to the substance or scheduling of salary surveys conducted by the Birches Group, without obtaining prior written authorization from the Birches Group.\n\nc. Subscriber shall not decompile, disassemble, reverse engineer or attempt to reconstruct, identify or discover any source code, underlying ideas, underlying user interface techniques or algorithms of the Service Provider Content by any means whatsoever, or disclose any of the foregoing.\n\nd. Except as expressly permitted herein, Subscriber may not modify, create derivatives of, copy, distribute, broadcast, transmit, reproduce, publish, license, transfer, sell, mirror, frame, data mine or otherwise use any Service Provider Content or any Confidential Information.\n\ne. Subscriber shall not knowingly take any action that would cause the Service Provider Content or source code, if derived by Subscriber or otherwise derived, thereof to be placed in the public domain. Subscriber may not post any Service Provider Content to forums, newsgroups, list serves, mailing lists, electronic bulletin boards or web sites without the prior written consent of Service Provider.\n\nf. Subscriber agrees that any use of the Service Provider Content other than as permitted herein is a violation of this Agreement. Subscriber further agrees that access to Service Provider Content via a Service Provider web site or web services may be subject to additional terms of use posted on such site.\n\ng. Subscriber agrees to participate in the Birches Group salary survey for the Subscribed Locations listed in section 12 of this agreement provided that Subscriber maintains offices and/or operations in the countries of the Subscribed Locations. Birches Group may at its sole discretion provide Subscriber with access to the Service Provider Content for a Subscribed Location prior to Subscriber’s participation in the survey for that Subscribed Location."]
[]
[null,"8.  UserID and Password","Subscriber agrees to maintain as private and confidential information any UserID and password that provides Subscriber with access to the Service Provider Content. Unauthorized use of Subscriber’s UserID(s) and password(s), with or without Subscriber’s knowledge, is a breach of this Agreement. Subscriber agrees to be solely responsible for the use of Subscriber’s UserID(s) and password(s) and to immediately notify Service Provider if Subscriber becomes aware of any loss, theft or unauthorized use of the same."]
[]
[null,"9.  Limitation of Liabilities","IN NO EVENT SHALL THE BIRCHES GROUP OR SUBSCRIBER BE LIABLE TO THE OTHER PARTY OR ANY THIRD PARTY FOR ANY INCIDENTAL, CONSEQUENTIAL, INDIRECT, SPECIAL, OR EXEMPLARY DAMAGES OF ANY NATURE, INCLUDING, BUT NOT LIMITED TO, LOSS OF PROFITS, DATA, BUSINESS OR GOODWILL, EVEN IF THE OTHER PARTY HAS BEEN ADVISED OF THE POSSIBILITY OF SUCH DAMAGES. IN NO EVENT SHALL BIRCHES GROUP BE LIABLE TO THE SUBSCRIBER FOR DIRECT DAMAGES IN EXCESS OF THE AMOUNTS PAID UNDER THIS AGREEMENT FOR THE SERVICES WHICH ARE THE SUBJECT OF THE CLAIM."]
[]
[null,"10.  Initial Subscription Term","This Agreement shall take effect on the date (“Effective Date”) the UserID(s) and password(s) to the online Service Provider Content is sent to Subscriber via email. This Agreement shall remain in effect for one year from the Effective Date, unless renewed in accordance to section 11 of this agreement. Notwithstanding the foregoing, Service Provider may terminate this Agreement and suspend Subscriber’s access to the Service Provider Content in the unlikely event that Subscriber fails to comply with any term or condition contained herein."]
[]
[null,"11.  Renewal","This Agreement may be renewed for successive terms of one year upon agreement of the Parties, provided that the applicable fees are paid and subject to any new terms and conditions required by Service Provider at the time of renewal. Service Provider will provide Subscriber with written notice of any such terms and conditions in advance of such renewal. In the absence of another written agreement to the contrary, this Agreement shall renew and apply to any future subscriptions to Service Provider Content. The issuance of an invoice by the Service Provider for a new subscription to the Service Provider Content and the payment thereof by the Subscriber shall be sufficient evidence of Parties’ agreement to renew this Agreement."]
[]
[null,"12.  Subscribed Locations","Subscribed locations will include those countries designated on the Order Form and Country Selection tabs of this document."]
[]
[null,"13.  Subscription Fees","Subscription fees are detailed in the Order Form under Subscription Fees."]
[]
[null,"14.  Taxes","All fees are expressed net of tax.  If any income tax, withholding tax, VAT or similar taxes are payable, the invoice amount will be increased (grossed-up) and taxes will be withheld from the resulting balance.  This ensures full compliance with local laws and requirements."]
[]
[null,"15.  Payment Schedule","Subscription fees will be invoiced in full upon the execution of this Agreement."]
[]
[null,"16.  Payments","All payments are due net thirty (30) days of invoice date. Late payments are subject to late payment fees equal to the lesser of 1.5% per month on any outstanding balance or the maximum permitted by law. Subscriber shall be responsible for all collection costs associated with the collection of late payments, including attorneys’ fees and bank fees for returned checks or refused transactions. Service Provider may suspend or terminate Subscriber’s subscription if any payment is more than thirty (30) days late."]
[]
[null,"17.  Data Storage","The data collected in our compensation and benefits surveys will be processed by Birches Group. The data may also be transferred or stored in a destination outside of its country or region of origin. Participation in the survey indicates your acceptance of these terms and requires Birches Group to take steps to protect the data in a manner consistent with our Privacy Policies and to limit our use of the data solely for the purposes of survey analysis and administration. If you do not find these terms acceptable, you may not participate in the survey."]
[]
[null,"18. Data Submission\nRequired","Subscriber understands and agrees that submission of Subscriber's data for Subscribed Locations is required, or a non-participant surcharge shall apply.  Data submissions are expected to be completed within 60 days following Subscriber's annual compensation review, or 60 days after access to the survey is first granted, whichever is later.\n\nIf access is initially granted less than four months prior to organization's pay review date, data collection following the next pay review date will satisfy the participation requirement.\n\nFailure to provide data within the required timeframe will result in suspension of all accounts until data is received.  After an additional 30 days, Subscriber will be billed a non-participation surcharge of 50% of the base survey fee, including multi-sector add-on, for each country for which data is not submitted.  If account access is suspended, a reconnection fee of $200 per account shall be applied."]
[]
[null,"19.  General","a. This Agreement constitutes the entire Agreement between the parties and supersedes all prior oral and written agreements and all contemporaneous oral negotiations, commitments and understandings.\n\nb. The headings of this Agreement are informational only and do not limit the scope or content of the subject matter contained therein.\n\nc. No waiver, amendment, or modification of this Agreement shall be effective unless it is in writing and signed by both parties.\n\nd. Subscriber may not assign or transfer Subscriber’s rights under this Agreement.\n\ne. Should any provision of this Agreement be held to be void or unenforceable, the remaining provisions shall remain in full force and effect to be read and construed as if the void or unenforceable provisions were originally deleted.\n\nf. The validity, interpretation and performance of this Agreement shall be governed by the laws of the State of New York, excluding its conflicts of laws provisions"]
[]
[null,"Acceptance of Terms and Conditions","On behalf of the Subscriber, I confirm acceptance of the terms and conditions for participation and access to Birches Group Surveys, as outlined in the Subscription Agreement above.  (Check the box below to complete.)"]
[]
[]
[]
[]
[]
[]
[]
[]
[]
[]
[]
[]
[]
[]
[]
[]
[]
[]
[]
[]
[]
[]
[]
[]
[]
[]
[]
[]
[]
[]
[]
[]
[]
[]
[]
[]
[]
[]
[]
[null,null,false]

{"sheet":"Survey Access","index":10,"n_rows":201,"n_cols":128,"rows_kept":201,"cut":false,"hidden":false,"merged":[[62,3,62,12],[62,13,62,25],[62,26,62,34],[62,35,62,45],[62,46,62,63],[62,64,62,77],[62,78,62,91],[60,3,60,12],[60,13,60,25],[60,26,60,34],[60,35,60,45],[60,46,60,63],[60,64,60,77],[60,78,60,91],[61,3,61,12],[61,13,61,25],[61,26,61,34],[61,35,61,45],[61,46,61,63],[61,64,61,77],[61,78,61,91],[58,3,58,12],[58,13,58,25],[58,26,58,34],[58,35,58,45],[58,46,58,63],[58,64,58,77],[58,78,58,91],[59,3,59,12],[59,13,59,25],[59,26,59,34],[59,35,59,45],[59,46,59,63],[59,64,59,77],[59,78,59,91],[56,3,56,12],[56,13,56,25],[56,26,56,34],[56,35,56,45],[56,46,56,63],[56,64,56,77],[56,78,56,91],[57,3,57,12],[57,13,57,25],[57,26,57,34],[57,35,57,45],[57,46,57,63],[57,64,57,77],[57,78,57,91],[54,3,54,12],[54,13,54,25],[54,26,54,34],[54,35,54,45],[54,46,54,63],[54,64,54,77],[54,78,54,91],[55,3,55,12],[55,13,55,25],[55,26,55,34],[55,35,55,45],[55,46,55,63],[55,64,55,77],[55,78,55,91],[52,3,52,12],[52,13,52,25],[52,26,52,34],[52,35,52,45],[52,46,52,63],[52,64,52,77],[52,78,52,91],[53,3,53,12],[53,13,53,25],[53,26,53,34],[53,35,53,45],[53,46,53,63],[53,64,53,77],[53,78,53,91],[50,3,50,12],[50,13,50,25],[50,26,50,34],[50,35,50,45],[50,46,50,63],[50,64,50,77],[50,78,50,91],[51,3,51,12],[51,13,51,25],[51,26,51,34],[51,35,51,45],[51,46,51,63],[51,64,51,77],[51,78,51,91],[48,3,48,12],[48,13,48,25],[48,26,48,34],[48,35,48,45],[48,46,48,63],[48,64,48,77],[48,78,48,91],[49,3,49,12],[49,13,49,25],[49,26,49,34],[49,35,49,45],[49,46,49,63],[49,64,49,77],[49,78,49,91],[26,96,26,114],[29,96,29,113],[27,96,28,115],[43,46,43,63],[43,78,43,91],[39,78,39,91],[40,78,40,91],[41,46,41,63],[41,78,41,91],[200,26,200,34],[200,35,200,45],[200,46,200,63],[200,64,200,77],[200,78,200,91],[31,78,31,91],[40,46,40,63],[26,78,26,91],[27,46,27,63],[27,78,27,91],[26,46,26,63],[28,78,28,91],[28,46,28,63],[42,46,42,63],[34,46,34,63],[42,78,42,91],[39,64,39,77],[40,64,40,77],[41,64,41,77],[42,64,42,77],[43,64,43,77],[34,26,34,34],[35,26,35,34],[36,26,36,34],[42,3,42,12],[43,3,43,12],[12,2,12,134],[36,78,36,91],[37,46,37,63],[37,78,37,91],[38,46,38,63],[38,78,38,91],[36,46,36,63],[34,78,34,91],[33,46,33,63],[33,78,33,91],[29,46,29,63],[32,78,32,91],[30,78,30,91],[35,46,35,63],[35,78,35,91],[29,78,29,91],[39,46,39,63],[25,46,25,63],[32,46,32,63],[30,46,30,63],[31,46,31,63],[25,78,25,91],[33,3,33,12],[34,3,34,12],[35,3,35,12],[36,3,36,12],[37,3,37,12],[38,3,38,12],[39,3,39,12],[40,3,40,12],[41,3,41,12],[25,13,25,25],[26,13,26,25],[27,13,27,25],[28,13,28,25],[29,13,29,25],[30,13,30,25],[31,13,31,25],[32,13,32,25],[25,3,25,12],[26,3,26,12],[27,3,27,12],[28,3,28,12],[29,3,29,12],[30,3,30,12],[31,3,31,12],[32,3,32,12],[33,13,33,25],[34,13,34,25],[35,13,35,25],[36,13,36,25],[37,13,37,25],[38,13,38,25],[39,13,39,25],[40,13,40,25],[41,13,41,25],[42,13,42,25],[43,13,43,25],[24,2,24,25],[24,26,24,45],[25,64,25,77],[25,35,25,45],[26,35,26,45],[27,35,27,45],[28,35,28,45],[29,35,29,45],[30,35,30,45],[31,35,31,45],[32,35,32,45],[33,35,33,45],[34,35,34,45],[35,35,35,45],[36,35,36,45],[37,35,37,45],[38,35,38,45],[39,35,39,45],[40,35,40,45],[41,35,41,45],[42,35,42,45],[43,35,43,45],[25,26,25,34],[26,26,26,34],[27,26,27,34],[28,26,28,34],[29,26,29,34],[30,26,30,34],[31,26,31,34],[32,26,32,34],[33,26,33,34],[37,26,37,34],[38,26,38,34],[39,26,39,34],[40,26,40,34],[41,26,41,34],[42,26,42,34],[22,2,22,54],[14,2,14,72],[200,3,200,12],[200,13,200,25],[43,26,43,34],[26,64,26,77],[27,64,27,77],[28,64,28,77],[29,64,29,77],[30,64,30,77],[31,64,31,77],[32,64,32,77],[33,64,33,77],[34,64,34,77],[35,64,35,77],[36,64,36,77],[37,64,37,77],[38,64,38,77],[44,3,44,12],[44,13,44,25],[44,35,44,45],[44,46,44,63],[44,64,44,77],[44,78,44,91],[44,26,44,34],[45,3,45,12],[45,13,45,25],[45,35,45,45],[45,46,45,63],[45,64,45,77],[45,78,45,91],[45,26,45,34],[46,3,46,12],[46,13,46,25],[46,35,46,45],[46,46,46,63],[46,64,46,77],[46,78,46,91],[46,26,46,34],[47,3,47,12],[47,13,47,25],[47,35,47,45],[47,46,47,63],[47,64,47,77],[47,78,47,91],[47,26,47,34]]}
[]
[]
[]
[]
[]
[]
[]
[]
[]
[]
[null,null,"This section is used to confirm the contact information for those individuals who will receive access to the survey.  Each person listed below will receive a separate User Account and Password."]
[]
[null,null,"When finished, use the buttons to navigate to the next contacts sheet or return to the Order Form."]
[]
[null,null,"Note:  If Indigo™ access is included in your subscription, be sure to indicate if users should have access to Indigo™ or if their access should be limited to Reports Only."]
[]
[]
[]
[]
[null,null,null,null,null,null,null,null,null,null,null,null,null,null,null,null,null,null,null,null,null,null,null,null,null,null,null,null,null,null,null,null,null,null,null,null,null,null,null,null,null,null,null,null,null,null,null,null,null,null,null,null,null,null,null,null,null,null,null,null,null,null,null,null,null,null,null,null,null,null,null,null,null,null,null,null,null,null,null,null,null,null,null,null,null,null,null,null,null,null,null,null,null,null,null,null,null,null,null,null,null,null,null,null,null,null,null,null,null,null,null,null,null,null,null,null,null,null,{"$f":"IF(AND(OrgType1=\"Commercial Development Org or Other Non-Profit\",ProductOption=\"Ad-Hoc Subscriber\"),\"AdhocRange_CDO\",IF(ProductOption=\"Ad-Hoc Subscriber\",\"AdhocRange_NGO\",IF(ProductOption=\"Sustaining Contributor\",\"SCRange\",\"SP\")))","v":"SP"},null,"Range to Check"]
[]
[null,null,"Survey Access"]
[null,null,"Please indicate below, for each country in which you registered, the persons who should have access to the survey results."]
[null,null,{"$f":"COLUMN(C24)-2","v":1},{"$f":"COLUMN(D24)-2","v":2},null,null,null,null,null,null,null,null,null,{"$f":"COLUMN(N24)-2","v":12},null,null,null,null,null,null,null,null,null,null,null,null,{"$f":"COLUMN(AA24)-2","v":25},null,null,null,null,null,null,null,null,{"$f":"COLUMN(AJ24)-2","v":34},null,null,null,null,null,null,null,null,null,null,{"$f":"COLUMN(AU24)-2","v":45},null,null,null,null,null,null,null,null,null,null,null,null,null,null,null,null,null,{"$f":"COLUMN(BM24)-2","v":63},null,null,null,null,null,null,null,null,null,null,null,null,null,{"$f":"COLUMN(CA24)-2","v":77}]
[null,null,"Name"]
[null,null,"Salutation","First or Given Name",null,null,null,null,null,null,null,null,null,"Last or Surname(s)",null,null,null,null,null,null,null,null,null,null,null,null,"Survey Country",null,null,null,null,null,null,null,null,"Type of Access",null,null,null,null,null,null,null,null,null,null,"Job Title",null,null,null,null,null,null,null,null,null,null,null,null,null,null,null,null,null,"Phone Number \n(including country code)",null,null,null,null,null,null,null,null,null,null,null,null,null,"E-mail Address",null,null,null,null,null,null,null,null,null,null,null,null,null,null,null,null,null,null,null,null,null,null,null,null,null,null,null,null,null,null,null,null,null,null,null,null,null,null,null,null,null,null,null,null,null,null,null,null,"Indigo™ Check"]
[null,null,null,null,null,null,null,null,null,null,null,null,null,null,null,null,null,null,null,null,null,null,null,null,null,null,null,null,null,null,null,null,null,null,null,null,null,null,null,null,null,null,null,null,null,null,null,null,null,null,null,null,null,null,null,null,null,null,null,null,null,null,null,null,null,null,null,null,null,null,null,null,null,null,null,null,null,null,null,null,null,null,null,null,null,null,null,null,null,null,null,null,null,null,null,null,null,null,null,null,null,null,null,null,null,null,null,null,null,null,null,null,null,null,null,null,null,null,null,null,null,null,null,null,null,null,null,{"$f":"IF(ISNUMBER(SEARCH(\",\",AA27)),1,IF($DO$20=\"SP\",1,IF(AA27=\"All Countries\",1,IF(VLOOKUP(AA27,INDIRECT($DO$20),3,FALSE)>0,1,0))))","v":1}]
[null,null,null,null,null,null,null,null,null,null,null,null,null,null,null,null,null,null,null,null,null,null,null,null,null,null,null,null,null,null,null,null,null,null,null,null,null,null,null,null,null,null,null,null,null,null,null,null,null,null,null,null,null,null,null,null,null,null,null,null,null,null,null,null,null,null,null,null,null,null,null,null,null,null,null,null,null,null,null,null,null,null,null,null,null,null,null,null,null,null,null,null,null,null,null,null,"Note: You may select multiple survey countries on the same line by simply making additional selections  before moving the cursor to the next line.",null,null,null,null,null,null,null,null,null,null,null,null,null,null,null,null,null,null,null,null,null,null,null,null,null,null,null,null,null,null,{"$f":"IF(ISNUMBER(SEARCH(\",\",AA28)),1,IF($DO$20=\"SP\",1,IF(AA28=\"All Countries\",1,IF(VLOOKUP(AA28,INDIRECT($DO$20),3,FALSE)>0,1,0))))","v":1}]
[null,null,null,null,null,null,null,null,null,null,null,null,null,null,null,null,null,null,null,null,null,null,null,null,null,null,null,null,null,null,null,null,null,null,null,null,null,null,null,null,null,null,null,null,null,null,null,null,null,null,null,null,null,null,null,null,null,null,null,null,null,null,null,null,null,null,null,null,null,null,null,null,null,null,null,null,null,null,null,null,null,null,null,null,null,null,null,null,null,null,null,null,null,null,null,null,null,null,null,null,null,null,null,null,null,null,null,null,null,null,null,null,null,null,null,null,null,null,null,null,null,null,null,null,null,null,null,1]
[null,null,null,null,null,null,null,null,null,null,null,null,null,null,null,null,null,null,null,null,null,null,null,null,null,null,null,null,null,null,null,null,null,null,null,null,null,null,null,null,null,null,null,null,null,null,null,null,null,null,null,null,null,null,null,null,null,null,null,null,null,null,null,null,null,null,null,null,null,null,null,null,null,null,null,null,null,null,null,null,null,null,null,null,null,null,null,null,null,null,null,null,null,null,null,null,"To edit, first delete the text and then start over.",null,null,null,null,null,null,null,null,null,null,null,null,null,null,null,null,null,null,null,null,null,null,null,null,null,null,null,null,null,null,1]
[null,null,null,null,null,null,null,null,null,null,null,null,null,null,null,null,null,null,null,null,null,null,null,null,null,null,null,null,null,null,null,null,null,null,null,null,null,null,null,null,null,null,null,null,null,null,null,null,null,null,null,null,null,null,null,null,null,null,null,null,null,null,null,null,null,null,null,null,null,null,null,null,null,null,null,null,null,null,null,null,null,null,null,null,null,null,null,null,null,null,null,null,null,null,null,null,null,null,null,null,null,null,null,null,null,null,null,null,null,null,null,null,null,null,null,null,null,null,null,null,null,null,null,null,null,null,null,1]
[null,null,null,null,null,null,null,null,null,null,null,null,null,null,null,null,null,null,null,null,null,null,null,null,null,null,null,null,null,null,null,null,null,null,null,null,null,null,null,null,null,null,null,null,null,null,null,null,null,null,null,null,null,null,null,null,null,null,null,null,null,null,null,null,null,null,null,null,null,null,null,null,null,null,null,null,null,null,null,null,null,null,null,null,null,null,null,null,null,null,null,null,null,null,null,null,null,null,null,null,null,null,null,null,null,null,null,null,null,null,null,null,null,null,null,null,null,null,null,null,null,null,null,null,null,null,null,1]
[null,null,null,null,null,null,null,null,null,null,null,null,null,null,null,null,null,null,null,null,null,null,null,null,null,null,null,null,null,null,null,null,null,null,null,null,null,null,null,null,null,null,null,null,null,null,null,null,null,null,null,null,null,null,null,null,null,null,null,null,null,null,null,null,null,null,null,null,null,null,null,null,null,null,null,null,null,null,null,null,null,null,null,null,null,null,null,null,null,null,null,null,null,null,null,null,null,null,null,null,null,null,null,null,null,null,null,null,null,null,null,null,null,null,null,null,null,null,null,null,null,null,null,null,null,null,null,1]
[null,null,null,null,null,null,null,null,null,null,null,null,null,null,null,null,null,null,null,null,null,null,null,null,null,null,null,null,null,null,null,null,null,null,null,null,null,null,null,null,null,null,null,null,null,null,null,null,null,null,null,null,null,null,null,null,null,null,null,null,null,null,null,null,null,null,null,null,null,null,null,null,null,null,null,null,null,null,null,null,null,null,null,null,null,null,null,null,null,null,null,null,null,null,null,null,null,null,null,null,null,null,null,null,null,null,null,null,null,null,null,null,null,null,null,null,null,null,null,null,null,null,null,null,null,null,null,1]
[null,null,null,null,null,null,null,null,null,null,null,null,null,null,null,null,null,null,null,null,null,null,null,null,null,null,null,null,null,null,null,null,null,null,null,null,null,null,null,null,null,null,null,null,null,null,null,null,null,null,null,null,null,null,null,null,null,null,null,null,null,null,null,null,null,null,null,null,null,null,null,null,null,null,null,null,null,null,null,null,null,null,null,null,null,null,null,null,null,null,null,null,null,null,null,null,null,null,null,null,null,null,null,null,null,null,null,null,null,null,null,null,null,null,null,null,null,null,null,null,null,null,null,null,null,null,null,1]
[null,null,null,null,null,null,null,null,null,null,null,null,null,null,null,null,null,null,null,null,null,null,null,null,null,null,null,null,null,null,null,null,null,null,null,null,null,null,null,null,null,null,null,null,null,null,null,null,null,null,null,null,null,null,null,null,null,null,null,null,null,null,null,null,null,null,null,null,null,null,null,null,null,null,null,null,null,null,null,null,null,null,null,null,null,null,null,null,null,null,null,null,null,null,null,null,null,null,null,null,null,null,null,null,null,null,null,null,null,null,null,null,null,null,null,null,null,null,null,null,null,null,null,null,null,null,null,1]
[null,null,null,null,null,null,null,null,null,null,null,null,null,null,null,null,null,null,null,null,null,null,null,null,null,null,null,null,null,null,null,null,null,null,null,null,null,null,null,null,null,null,null,null,null,null,null,null,null,null,null,null,null,null,null,null,null,null,null,null,null,null,null,null,null,null,null,null,null,null,null,null,null,null,null,null,null,null,null,null,null,null,null,null,null,null,null,null,null,null,null,null,null,null,null,null,null,null,null,null,null,null,null,null,null,null,null,null,null,null,null,null,null,null,null,null,null,null,null,null,null,null,null,null,null,null,null,1]
[null,null,null,null,null,null,null,null,null,null,null,null,null,null,null,null,null,null,null,null,null,null,null,null,null,null,null,null,null,null,null,null,null,null,null,null,null,null,null,null,null,null,null,null,null,null,null,null,null,null,null,null,null,null,null,null,null,null,null,null,null,null,null,null,null,null,null,null,null,null,null,null,null,null,null,null,null,null,null,null,null,null,null,null,null,null,null,null,null,null,null,null,null,null,null,null,null,null,null,null,null,null,null,null,null,null,null,null,null,null,null,null,null,null,null,null,null,null,null,null,null,null,null,null,null,null,null,1]
[null,null,null,null,null,null,null,null,null,null,null,null,null,null,null,null,null,null,null,null,null,null,null,null,null,null,null,null,null,null,null,null,null,null,null,null,null,null,null,null,null,null,null,null,null,null,null,null,null,null,null,null,null,null,null,null,null,null,null,null,null,null,null,null,null,null,null,null,null,null,null,null,null,null,null,null,null,null,null,null,null,null,null,null,null,null,null,null,null,null,null,null,null,null,null,null,null,null,null,null,null,null,null,null,null,null,null,null,null,null,null,null,null,null,null,null,null,null,null,null,null,null,null,null,null,null,null,1]
[null,null,null,null,null,null,null,null,null,null,null,null,null,null,null,null,null,null,null,null,null,null,null,null,null,null,null,null,null,null,null,null,null,null,null,null,null,null,null,null,null,null,null,null,null,null,null,null,null,null,null,null,null,null,null,null,null,null,null,null,null,null,null,null,null,null,null,null,null,null,null,null,null,null,null,null,null,null,null,null,null,null,null,null,null,null,null,null,null,null,null,null,null,null,null,null,null,null,null,null,null,null,null,null,null,null,null,null,null,null,null,null,null,null,null,null,null,null,null,null,null,null,null,null,null,null,null,1]
[null,null,null,null,null,null,null,null,null,null,null,null,null,null,null,null,null,null,null,null,null,null,null,null,null,null,null,null,null,null,null,null,null,null,null,null,null,null,null,null,null,null,null,null,null,null,null,null,null,null,null,null,null,null,null,null,null,null,null,null,null,null,null,null,null,null,null,null,null,null,null,null,null,null,null,null,null,null,null,null,null,null,null,null,null,null,null,null,null,null,null,null,null,null,null,null,null,null,null,null,null,null,null,null,null,null,null,null,null,null,null,null,null,null,null,null,null,null,null,null,null,null,null,null,null,null,null,1]
[null,null,null,null,null,null,null,null,null,null,null,null,null,null,null,null,null,null,null,null,null,null,null,null,null,null,null,null,null,null,null,null,null,null,null,null,null,null,null,null,null,null,null,null,null,null,null,null,null,null,null,null,null,null,null,null,null,null,null,null,null,null,null,null,null,null,null,null,null,null,null,null,null,null,null,null,null,null,null,null,null,null,null,null,null,null,null,null,null,null,null,null,null,null,null,null,null,null,null,null,null,null,null,null,null,null,null,null,null,null,null,null,null,null,null,null,null,null,null,null,null,null,null,null,null,null,null,1]
[null,null,null,null,null,null,null,null,null,null,null,null,null,null,null,null,null,null,null,null,null,null,null,null,null,null,null,null,null,null,null,null,null,null,null,null,null,null,null,null,null,null,null,null,null,null,null,null,null,null,null,null,null,null,null,null,null,null,null,null,null,null,null,null,null,null,null,null,null,null,null,null,null,null,null,null,null,null,null,null,null,null,null,null,null,null,null,null,null,null,null,null,null,null,null,null,null,null,null,null,null,null,null,null,null,null,null,null,null,null,null,null,null,null,null,null,null,null,null,null,null,null,null,null,null,null,null,1]
[null,null,null,null,null,null,null,null,null,null,null,null,null,null,null,null,null,null,null,null,null,null,null,null,null,null,null,null,null,null,null,null,null,null,null,null,null,null,null,null,null,null,null,null,null,null,null,null,null,null,null,null,null,null,null,null,null,null,null,null,null,null,null,null,null,null,null,null,null,null,null,null,null,null,null,null,null,null,null,null,null,null,null,null,null,null,null,null,null,null,null,null,null,null,null,null,null,null,null,null,null,null,null,null,null,null,null,null,null,null,null,null,null,null,null,null,null,null,null,null,null,null,null,null,null,null,null,1]
[null,null,null,null,null,null,null,null,null,null,null,null,null,null,null,null,null,null,null,null,null,null,null,null,null,null,null,null,null,null,null,null,null,null,null,null,null,null,null,null,null,null,null,null,null,null,null,null,null,null,null,null,null,null,null,null,null,null,null,null,null,null,null,null,null,null,null,null,null,null,null,null,null,null,null,null,null,null,null,null,null,null,null,null,null,null,null,null,null,null,null,null,null,null,null,null,null,null,null,null,null,null,null,null,null,null,null,null,null,null,null,null,null,null,null,null,null,null,null,null,null,null,null,null,null,null,null,1]
[null,null,null,null,null,null,null,null,null,null,null,null,null,null,null,null,null,null,null,null,null,null,null,null,null,null,null,null,null,null,null,null,null,null,null,null,null,null,null,null,null,null,null,null,null,null,null,null,null,null,null,null,null,null,null,null,null,null,null,null,null,null,null,null,null,null,null,null,null,null,null,null,null,null,null,null,null,null,null,null,null,null,null,null,null,null,null,null,null,null,null,null,null,null,null,null,null,null,null,null,null,null,null,null,null,null,null,null,null,null,null,null,null,null,null,null,null,null,null,null,null,null,null,null,null,null,null,1]
[null,null,null,null,null,null,null,null,null,null,null,null,null,null,null,null,null,null,null,null,null,null,null,null,null,null,null,null,null,null,null,null,null,null,null,null,null,null,null,null,null,null,null,null,null,null,null,null,null,null,null,null,null,null,null,null,null,null,null,null,null,null,null,null,null,null,null,null,null,null,null,null,null,null,null,null,null,null,null,null,null,null,null,null,null,null,null,null,null,null,null,null,null,null,null,null,null,null,null,null,null,null,null,null,null,null,null,null,null,null,null,null,null,null,null,null,null,null,null,null,null,null,null,null,null,null,null,1]
[null,null,null,null,null,null,null,null,null,null,null,null,null,null,null,null,null,null,null,null,null,null,null,null,null,null,null,null,null,null,null,null,null,null,null,null,null,null,null,null,null,null,null,null,null,null,null,null,null,null,null,null,null,null,null,null,null,null,null,null,null,null,null,null,null,null,null,null,null,null,null,null,null,null,null,null,null,null,null,null,null,null,null,null,null,null,null,null,null,null,null,null,null,null,null,null,null,null,null,null,null,null,null,null,null,null,null,null,null,null,null,null,null,null,null,null,null,null,null,null,null,null,null,null,null,null,null,1]
[null,null,null,null,null,null,null,null,null,null,null,null,null,null,null,null,null,null,null,null,null,null,null,null,null,null,null,null,null,null,null,null,null,null,null,null,null,null,null,null,null,null,null,null,null,null,null,null,null,null,null,null,null,null,null,null,null,null,null,null,null,null,null,null,null,null,null,null,null,null,null,null,null,null,null,null,null,null,null,null,null,null,null,null,null,null,null,null,null,null,null,null,null,null,null,null,null,null,null,null,null,null,null,null,null,null,null,null,null,null,null,null,null,null,null,null,null,null,null,null,null,null,null,null,null,null,null,1]
[null,null,null,null,null,null,null,null,null,null,null,null,null,null,null,null,null,null,null,null,null,null,null,null,null,null,null,null,null,null,null,null,null,null,null,null,null,null,null,null,null,null,null,null,null,null,null,null,null,null,null,null,null,null,null,null,null,null,null,null,null,null,null,null,null,null,null,null,null,null,null,null,null,null,null,null,null,null,null,null,null,null,null,null,null,null,null,null,null,null,null,null,null,null,null,null,null,null,null,null,null,null,null,null,null,null,null,null,null,null,null,null,null,null,null,null,null,null,null,null,null,null,null,null,null,null,null,1]
[null,null,null,null,null,null,null,null,null,null,null,null,null,null,null,null,null,null,null,null,null,null,null,null,null,null,null,null,null,null,null,null,null,null,null,null,null,null,null,null,null,null,null,null,null,null,null,null,null,null,null,null,null,null,null,null,null,null,null,null,null,null,null,null,null,null,null,null,null,null,null,null,null,null,null,null,null,null,null,null,null,null,null,null,null,null,null,null,null,null,null,null,null,null,null,null,null,null,null,null,null,null,null,null,null,null,null,null,null,null,null,null,null,null,null,null,null,null,null,null,null,null,null,null,null,null,null,1]
[null,null,null,null,null,null,null,null,null,null,null,null,null,null,null,null,null,null,null,null,null,null,null,null,null,null,null,null,null,null,null,null,null,null,null,null,null,null,null,null,null,null,null,null,null,null,null,null,null,null,null,null,null,null,null,null,null,null,null,null,null,null,null,null,null,null,null,null,null,null,null,null,null,null,null,null,null,null,null,null,null,null,null,null,null,null,null,null,null,null,null,null,null,null,null,null,null,null,null,null,null,null,null,null,null,null,null,null,null,null,null,null,null,null,null,null,null,null,null,null,null,null,null,null,null,null,null,1]
[null,null,null,null,null,null,null,null,null,null,null,null,null,null,null,null,null,null,null,null,null,null,null,null,null,null,null,null,null,null,null,null,null,null,null,null,null,null,null,null,null,null,null,null,null,null,null,null,null,null,null,null,null,null,null,null,null,null,null,null,null,null,null,null,null,null,null,null,null,null,null,null,null,null,null,null,null,null,null,null,null,null,null,null,null,null,null,null,null,null,null,null,null,null,null,null,null,null,null,null,null,null,null,null,null,null,null,null,null,null,null,null,null,null,null,null,null,null,null,null,null,null,null,null,null,null,null,1]
[null,null,null,null,null,null,null,null,null,null,null,null,null,null,null,null,null,null,null,null,null,null,null,null,null,null,null,null,null,null,null,null,null,null,null,null,null,null,null,null,null,null,null,null,null,null,null,null,null,null,null,null,null,null,null,null,null,null,null,null,null,null,null,null,null,null,null,null,null,null,null,null,null,null,null,null,null,null,null,null,null,null,null,null,null,null,null,null,null,null,null,null,null,null,null,null,null,null,null,null,null,null,null,null,null,null,null,null,null,null,null,null,null,null,null,null,null,null,null,null,null,null,null,null,null,null,null,1]
[null,null,null,null,null,null,null,null,null,null,null,null,null,null,null,null,null,null,null,null,null,null,null,null,null,null,null,null,null,null,null,null,null,null,null,null,null,null,null,null,null,null,null,null,null,null,null,null,null,null,null,null,null,null,null,null,null,null,null,null,null,null,null,null,null,null,null,null,null,null,null,null,null,null,null,null,null,null,null,null,null,null,null,null,null,null,null,null,null,null,null,null,null,null,null,null,null,null,null,null,null,null,null,null,null,null,null,null,null,null,null,null,null,null,null,null,null,null,null,null,null,null,null,null,null,null,null,1]
[null,null,null,null,null,null,null,null,null,null,null,null,null,null,null,null,null,null,null,null,null,null,null,null,null,null,null,null,null,null,null,null,null,null,null,null,null,null,null,null,null,null,null,null,null,null,null,null,null,null,null,null,null,null,null,null,null,null,null,null,null,null,null,null,null,null,null,null,null,null,null,null,null,null,null,null,null,null,null,null,null,null,null,null,null,null,null,null,null,null,null,null,null,null,null,null,null,null,null,null,null,null,null,null,null,null,null,null,null,null,null,null,null,null,null,null,null,null,null,null,null,null,null,null,null,null,null,1]
[null,null,null,null,null,null,null,null,null,null,null,null,null,null,null,null,null,null,null,null,null,null,null,null,null,null,null,null,null,null,null,null,null,null,null,null,null,null,null,null,null,null,null,null,null,null,null,null,null,null,null,null,null,null,null,null,null,null,null,null,null,null,null,null,null,null,null,null,null,null,null,null,null,null,null,null,null,null,null,null,null,null,null,null,null,null,null,null,null,null,null,null,null,null,null,null,null,null,null,null,null,null,null,null,null,null,null,null,null,null,null,null,null,null,null,null,null,null,null,null,null,null,null,null,null,null,null,1]
[null,null,null,null,null,null,null,null,null,null,null,null,null,null,null,null,null,null,null,null,null,null,null,null,null,null,null,null,null,null,null,null,null,null,null,null,null,null,null,null,null,null,null,null,null,null,null,null,null,null,null,null,null,null,null,null,null,null,null,null,null,null,null,null,null,null,null,null,null,null,null,null,null,null,null,null,null,null,null,null,null,null,null,null,null,null,null,null,null,null,null,null,null,null,null,null,null,null,null,null,null,null,null,null,null,null,null,null,null,null,null,null,null,null,null,null,null,null,null,null,null,null,null,null,null,null,null,1]
[null,null,null,null,null,null,null,null,null,null,null,null,null,null,null,null,null,null,null,null,null,null,null,null,null,null,null,null,null,null,null,null,null,null,null,null,null,null,null,null,null,null,null,null,null,null,null,null,null,null,null,null,null,null,null,null,null,null,null,null,null,null,null,null,null,null,null,null,null,null,null,null,null,null,null,null,null,null,null,null,null,null,null,null,null,null,null,null,null,null,null,null,null,null,null,null,null,null,null,null,null,null,null,null,null,null,null,null,null,null,null,null,null,null,null,null,null,null,null,null,null,null,null,null,null,null,null,1]
[null,null,null,null,null,null,null,null,null,null,null,null,null,null,null,null,null,null,null,null,null,null,null,null,null,null,null,null,null,null,null,null,null,null,null,null,null,null,null,null,null,null,null,null,null,null,null,null,null,null,null,null,null,null,null,null,null,null,null,null,null,null,null,null,null,null,null,null,null,null,null,null,null,null,null,null,null,null,null,null,null,null,null,null,null,null,null,null,null,null,null,null,null,null,null,null,null,null,null,null,null,null,null,null,null,null,null,null,null,null,null,null,null,null,null,null,null,null,null,null,null,null,null,null,null,null,null,1]
[null,null,null,null,null,null,null,null,null,null,null,null,null,null,null,null,null,null,null,null,null,null,null,null,null,null,null,null,null,null,null,null,null,null,null,null,null,null,null,null,null,null,null,null,null,null,null,null,null,null,null,null,null,null,null,null,null,null,null,null,null,null,null,null,null,null,null,null,null,null,null,null,null,null,null,null,null,null,null,null,null,null,null,null,null,null,null,null,null,null,null,null,null,null,null,null,null,null,null,null,null,null,null,null,null,null,null,null,null,null,null,null,null,null,null,null,null,null,null,null,null,null,null,null,null,null,null,1]
[null,null,null,null,null,null,null,null,null,null,null,null,null,null,null,null,null,null,null,null,null,null,null,null,null,null,null,null,null,null,null,null,null,null,null,null,null,null,null,null,null,null,null,null,null,null,null,null,null,null,null,null,null,null,null,null,null,null,null,null,null,null,null,null,null,null,null,null,null,null,null,null,null,null,null,null,null,null,null,null,null,null,null,null,null,null,null,null,null,null,null,null,null,null,null,null,null,null,null,null,null,null,null,null,null,null,null,null,null,null,null,null,null,null,null,null,null,null,null,null,null,null,null,null,null,null,null,1]
[null,null,null,null,null,null,null,null,null,null,null,null,null,null,null,null,null,null,null,null,null,null,null,null,null,null,null,null,null,null,null,null,null,null,null,null,null,null,null,null,null,null,null,null,null,null,null,null,null,null,null,null,null,null,null,null,null,null,null,null,null,null,null,null,null,null,null,null,null,null,null,null,null,null,null,null,null,null,null,null,null,null,null,null,null,null,null,null,null,null,null,null,null,null,null,null,null,null,null,null,null,null,null,null,null,null,null,null,null,null,null,null,null,null,null,null,null,null,null,null,null,null,null,null,null,null,null,1]
[]
[]
[]
[]
[]
[]
[]
[]
[]
[]
[]
[]
[]
[]
[]
[]
[]
[]
[]
[]
[]
[]
[]
[]
[]
[]
[]
[]
[]
[]
[]
[]
[]
[]
[]
[]
[]
[]
[]
[]
[]
[]
[]
[]
[]
[]
[]
[]
[]
[]
[]
[]
[]
[]
[]
[]
[]
[]
[]
[]
[]
[]
[]
[]
[]
[]
[]
[]
[]
[]
[]
[]
[]
[]
[]
[]
[]
[]
[]
[]
[]
[]
[]
[]
[]
[]
[]
[]
[]
[]
[]
[]
[]
[]
[]
[]
[]
[]
[]
[]
[]
[]
[]
[]
[]
[]
[]
[]
[]
[]
[]
[]
[]
[]
[]
[]
[]
[]
[]
[]
[]
[]
[]
[]
[]
[]
[]
[]
[]
[]
[]
[]
[]
[]
[]
[]
[]
[null,null,null,null,null,null,null,null,null,null,null,null,null,null,null,null,null,null,null,null,null,null,null,null,null,null,null,null,null,null,null,null,null,null,null,null,null,null,null,null,null,null,null,null,null,null,null,null,null,null,null,null,null,null,null,null,null,null,null,null,null,null,null,null,null,null,null,null,null,null,null,null,null,null,null,null,null,null,null,null,null,null,null,null,null,null,null,null,null,null,null,null,null,null,null,null,null,null,null,null,null,null,null,null,null,null,null,null,null,null,null,null,null,null,null,null,null,null,null,null,null,null,null,null,null,null,null,{"$f":"IF(ISNUMBER(SEARCH(\",\",AA201)),1,IF($DO$20=\"SP\",1,IF(AA201=\"All Countries\",1,IF(VLOOKUP(AA201,INDIRECT($DO$20),10,FALSE)=\"\",0,1))))","v":1}]

{"sheet":"Survey Contacts","index":11,"n_rows":48,"n_cols":136,"rows_kept":48,"cut":false,"hidden":false,"merged":[[39,2,39,10],[39,11,39,18],[39,19,39,36],[39,37,39,54],[39,55,39,72],[39,73,39,93],[39,94,39,107],[39,108,39,121],[39,122,39,135],[46,2,46,10],[46,11,46,18],[46,19,46,36],[46,37,46,54],[46,55,46,72],[46,73,46,93],[46,94,46,107],[46,108,46,121],[46,122,46,135],[45,2,45,10],[45,11,45,18],[45,19,45,36],[45,37,45,54],[45,55,45,72],[45,73,45,93],[45,94,45,107],[45,108,45,121],[45,122,45,135],[44,2,44,10],[44,11,44,18],[44,19,44,36],[44,37,44,54],[44,55,44,72],[44,73,44,93],[44,94,44,107],[44,108,44,121],[44,122,44,135],[43,2,43,10],[43,11,43,18],[43,19,43,36],[43,37,43,54],[43,55,43,72],[43,73,43,93],[43,94,43,107],[43,108,43,121],[43,122,43,135],[42,2,42,10],[42,11,42,18],[42,19,42,36],[42,37,42,54],[42,55,42,72],[42,73,42,93],[42,94,42,107],[42,108,42,121],[42,122,42,135],[40,55,40,72],[40,73,40,93],[40,94,40,107],[40,108,40,121],[40,122,40,135],[41,2,41,10],[41,11,41,18],[41,19,41,36],[41,37,41,54],[41,55,41,72],[41,73,41,93],[41,94,41,107],[41,108,41,121],[41,122,41,135],[40,19,40,36],[24,94,24,107],[24,108,24,121],[24,122,24,135],[26,2,26,10],[26,11,26,18],[26,19,26,36],[26,37,26,54],[26,55,26,72],[19,2,20,90],[25,2,25,10],[25,11,25,18],[25,19,25,36],[25,37,25,54],[25,55,25,72],[25,73,25,93],[24,2,24,10],[24,11,24,18],[24,19,24,36],[24,37,24,54],[24,55,24,72],[24,73,24,93],[25,94,25,107],[25,108,25,121],[25,122,25,135],[26,94,26,107],[26,108,26,121],[26,122,26,135],[27,108,27,121],[27,122,27,135],[28,73,28,93],[28,94,28,107],[28,108,28,121],[28,122,28,135],[27,73,27,93],[27,94,27,107],[27,19,27,36],[28,2,28,10],[28,11,28,18],[28,19,28,36],[28,37,28,54],[28,55,28,72],[27,37,27,54],[27,55,27,72],[26,73,26,93],[31,122,31,135],[32,2,32,10],[32,11,32,18],[32,19,32,36],[18,2,18,14],[32,37,32,54],[32,55,32,72],[32,73,32,93],[32,94,32,107],[32,108,32,121],[32,122,32,135],[30,108,30,121],[30,122,30,135],[31,2,31,10],[31,11,31,18],[31,19,31,36],[31,37,31,54],[31,55,31,72],[31,73,31,93],[31,94,31,107],[31,108,31,121],[29,94,29,107],[29,108,29,121],[29,122,29,135],[34,122,34,135],[33,94,33,107],[33,108,33,121],[33,122,33,135],[34,2,34,10],[34,11,34,18],[34,19,34,36],[34,37,34,54],[34,55,34,72],[34,73,34,93],[34,94,34,107],[33,2,33,10],[33,11,33,18],[33,19,33,36],[33,37,33,54],[33,55,33,72],[33,73,33,93],[35,11,35,18],[35,19,35,36],[35,37,35,54],[35,55,35,72],[40,2,40,10],[40,11,40,18],[40,37,40,54],[8,2,8,57],[34,108,34,121],[30,2,30,10],[30,11,30,18],[30,19,30,36],[30,37,30,54],[30,55,30,72],[30,73,30,93],[30,94,30,107],[29,2,29,10],[29,11,29,18],[29,19,29,36],[29,37,29,54],[29,55,29,72],[29,73,29,93],[27,2,27,10],[27,11,27,18],[174,2,174,10],[174,11,174,18],[174,19,174,36],[174,37,174,54],[174,55,174,72],[174,73,174,93],[174,94,174,107],[174,108,174,121],[174,122,174,135],[38,73,38,93],[38,94,38,107],[38,108,38,121],[38,122,38,135],[38,2,38,10],[38,11,38,18],[38,19,38,36],[38,37,38,54],[38,55,38,72],[10,2,10,114],[36,122,36,135],[37,2,37,10],[37,11,37,18],[37,19,37,36],[37,37,37,54],[37,55,37,72],[37,73,37,93],[37,94,37,107],[37,108,37,121],[37,122,37,135],[36,37,36,54],[36,55,36,72],[36,73,36,93],[36,94,36,107],[36,108,36,121],[35,73,35,93],[35,94,35,107],[35,108,35,121],[35,122,35,135],[36,2,36,10],[36,11,36,18],[36,19,36,36],[35,2,35,10],[47,2,47,10],[47,11,47,18],[47,19,47,36],[47,37,47,54],[47,55,47,72],[47,73,47,93],[47,94,47,107],[47,108,47,121],[47,122,47,135]]}
[]
[]
[]
[]
[]
[]
[]
[]
[null,null,"This section is used to indicate the names of individuals who will provide your organization's data for the survey"]
[]
[null,null,"When finished, use the buttons to navigate to the next contacts sheet or return to the Order Form."]
[]
[]
[]
[]
[]
[]
[]
[null,null,"Survey  DATA Contacts"]
[null,null,"Please indicate below, for each country in which you registered, the contact information for the individual who will provide the data for the survey.  If you need more space, click the Add Another Row button.   If there is just one individual, please copy the necessary information for each country."]
[]
[null,null,1,2,3,4,5,6,7,8,9,null,11,12,13,14,15,16,17,18,19,20,21,22,23,24,25,26,27,28,29,30,31,32,33,34,35,36,37,38,39,40,41,42,43,44,45,46,47,48,49,50,51,52,53,54,55,56,57,58,59,60,61,62,63,64,65,66,67,68,69,70,71,72,73,74,75,76,77,78,79,80,81,82,83,84,85,86,87,88,89,90,91,92,93,94,95,96,97,98,99,100,101,102,103,104,105,106,107,108,109,110,111,112,113,114,115,116,117,118,119,120,121,122,123,124,125,126,127,128,129,130,131,132,133,134]
[]
[null,null,{"$f":"COLUMN(C24)-2","v":1},null,null,null,null,null,null,null,null,{"$f":"COLUMN(L24)-2","v":10},null,null,null,null,null,null,null,{"$f":"COLUMN(T24)-2","v":18},null,null,null,null,null,null,null,null,null,null,null,null,null,null,null,null,null,{"$f":"COLUMN(AL24)-2","v":36},null,null,null,null,null,null,null,null,null,null,null,null,null,null,null,null,null,{"$f":"COLUMN(BD24)-2","v":54},null,null,null,null,null,null,null,null,null,null,null,null,null,null,null,null,null,{"$f":"COLUMN(BV24)-2","v":72},null,null,null,null,null,null,null,null,null,null,null,null,null,null,null,null,null,null,null,null,{"$f":"COLUMN(CQ24)-2","v":93},null,null,null,null,null,null,null,null,null,null,null,null,null,{"$f":"COLUMN(DE24)-2","v":107},null,null,null,null,null,null,null,null,null,null,null,null,null,{"$f":"COLUMN(DS24)-2","v":121}]
[null,null,"Survey Country",null,null,null,null,null,null,null,null,"Salutation",null,null,null,null,null,null,null,"First or Given Name",null,null,null,null,null,null,null,null,null,null,null,null,null,null,null,null,null,"Last or Surname(s)",null,null,null,null,null,null,null,null,null,null,null,null,null,null,null,null,null,"Job Title",null,null,null,null,null,null,null,null,null,null,null,null,null,null,null,null,null,"Phone Number (including country code)",null,null,null,null,null,null,null,null,null,null,null,null,null,null,null,null,null,null,null,null,"E-mail Address",null,null,null,null,null,null,null,null,null,null,null,null,null,"Skype Name",null,null,null,null,null,null,null,null,null,null,null,null,null,"Country Where Located"]
[{"$f":"ROW()","v":26},{"$f":"A26&C26","v":"26"}]
[{"$f":"ROW()","v":27},{"$f":"A27&C27","v":"27"}]
[{"$f":"ROW()","v":28},"28"]
[{"$f":"ROW()","v":29},"29"]
[{"$f":"ROW()","v":30},"30"]
[{"$f":"ROW()","v":31},"31"]
[{"$f":"ROW()","v":32},"32"]
[{"$f":"ROW()","v":33},"33"]
[{"$f":"ROW()","v":34},"34"]
[{"$f":"ROW()","v":35},"35"]
[{"$f":"ROW()","v":36},"36"]
[{"$f":"ROW()","v":37},"37"]
[{"$f":"ROW()","v":38},"38"]
[{"$f":"ROW()","v":39},"39"]
[{"$f":"ROW()","v":40},"40"]
[{"$f":"ROW()","v":41},"41"]
[{"$f":"ROW()","v":42},"42"]
[{"$f":"ROW()","v":43},"43"]
[{"$f":"ROW()","v":44},"44"]
[{"$f":"ROW()","v":45},"45"]
[{"$f":"ROW()","v":46},"46"]
[{"$f":"ROW()","v":47},"47"]
[{"$f":"ROW()","v":48},"48"]

{"sheet":"HQ and Regional Contacts","index":12,"n_rows":25,"n_cols":133,"rows_kept":25,"cut":false,"hidden":false,"merged":[[54,127,54,140],[54,2,54,10],[54,11,54,15],[54,16,54,23],[54,24,54,41],[54,42,54,59],[54,60,54,77],[54,78,54,98],[54,99,54,112],[54,113,54,126],[52,127,52,140],[53,2,53,10],[53,11,53,15],[53,16,53,23],[53,24,53,41],[53,42,53,59],[53,60,53,77],[53,78,53,98],[53,99,53,112],[53,113,53,126],[53,127,53,140],[52,2,52,10],[52,11,52,15],[52,16,52,23],[52,24,52,41],[52,42,52,59],[52,60,52,77],[52,78,52,98],[52,99,52,112],[52,113,52,126],[19,2,20,87],[24,2,24,10],[24,16,24,23],[24,24,24,41],[24,42,24,59],[24,60,24,77],[24,78,24,98],[24,11,24,15],[24,99,24,112],[24,113,24,126],[24,127,24,140],[25,2,25,10],[25,16,25,23],[25,24,25,41],[25,42,25,59],[25,60,25,77],[25,78,25,98],[25,99,25,112],[25,113,25,126],[25,127,25,140],[25,11,25,15],[26,2,26,10],[26,16,26,23],[26,24,26,41],[26,42,26,59],[26,60,26,77],[26,78,26,98],[26,99,26,112],[26,113,26,126],[26,127,26,140],[26,11,26,15],[27,2,27,10],[27,16,27,23],[27,24,27,41],[27,42,27,59],[27,60,27,77],[27,78,27,98],[27,99,27,112],[27,113,27,126],[27,127,27,140],[27,11,27,15],[28,99,28,112],[28,113,28,126],[28,127,28,140],[29,2,29,10],[29,16,29,23],[29,24,29,41],[29,42,29,59],[29,60,29,77],[29,78,29,98],[29,99,29,112],[28,2,28,10],[28,16,28,23],[28,24,28,41],[28,42,28,59],[28,60,28,77],[28,78,28,98],[29,113,29,126],[29,127,29,140],[28,11,28,15],[29,11,29,15],[31,42,31,59],[31,60,31,77],[31,78,31,98],[31,99,31,112],[31,113,31,126],[31,127,31,140],[30,2,30,10],[30,16,30,23],[30,24,30,41],[30,42,30,59],[30,60,30,77],[30,78,30,98],[30,99,30,112],[30,113,30,126],[30,127,30,140],[30,11,30,15],[31,2,31,10],[31,16,31,23],[31,24,31,41],[32,99,32,112],[32,113,32,126],[32,127,32,140],[33,2,33,10],[33,16,33,23],[33,24,33,41],[33,42,33,59],[33,60,33,77],[33,78,33,98],[33,99,33,112],[32,2,32,10],[32,16,32,23],[32,24,32,41],[32,42,32,59],[32,60,32,77],[32,78,32,98],[33,113,33,126],[33,127,33,140],[35,42,35,59],[35,60,35,77],[35,78,35,98],[35,99,35,112],[35,113,35,126],[35,127,35,140],[35,11,35,15],[34,2,34,10],[34,16,34,23],[34,24,34,41],[34,42,34,59],[34,60,34,77],[34,78,34,98],[34,99,34,112],[34,113,34,126],[34,127,34,140],[35,2,35,10],[35,16,35,23],[35,24,35,41],[37,2,37,10],[37,16,37,23],[37,24,37,41],[37,42,37,59],[37,60,37,77],[37,78,37,98],[37,99,37,112],[36,2,36,10],[36,16,36,23],[36,24,36,41],[36,42,36,59],[36,60,36,77],[36,78,36,98],[36,11,36,15],[39,42,39,59],[39,60,39,77],[39,78,39,98],[39,99,39,112],[39,113,39,126],[39,127,39,140],[38,2,38,10],[38,16,38,23],[38,24,38,41],[38,42,38,59],[38,60,38,77],[38,78,38,98],[38,99,38,112],[38,113,38,126],[39,2,39,10],[39,16,39,23],[39,24,39,41],[41,42,41,59],[41,60,41,77],[41,78,41,98],[41,99,41,112],[40,2,40,10],[40,16,40,23],[40,24,40,41],[40,42,40,59],[40,60,40,77],[40,78,40,98],[41,11,41,15],[44,42,44,59],[44,60,44,77],[44,78,44,98],[42,127,42,140],[43,2,43,10],[43,16,43,23],[43,24,43,41],[43,42,43,59],[43,60,43,77],[43,78,43,98],[43,99,43,112],[43,113,43,126],[43,127,43,140],[42,2,42,10],[42,16,42,23],[42,24,42,41],[42,42,42,59],[42,60,42,77],[42,78,42,98],[42,99,42,112],[42,113,42,126],[44,99,44,112],[44,113,44,126],[44,127,44,140],[173,2,173,10],[173,11,173,15],[45,113,45,126],[45,127,45,140],[46,2,46,10],[46,16,46,23],[46,24,46,41],[46,42,46,59],[46,60,46,77],[46,78,46,98],[46,99,46,112],[46,113,46,126],[45,2,45,10],[45,16,45,23],[45,24,45,41],[45,42,45,59],[45,60,45,77],[45,78,45,98],[45,99,45,112],[46,127,46,140],[47,42,47,59],[47,60,47,77],[47,78,47,98],[47,99,47,112],[41,113,41,126],[41,127,41,140],[40,99,40,112],[40,113,40,126],[40,127,40,140],[38,127,38,140],[37,113,37,126],[37,127,37,140],[36,127,36,140],[36,99,36,112],[36,113,36,126],[17,2,17,26],[8,2,8,79],[173,42,173,59],[173,60,173,77],[173,78,173,98],[173,99,173,112],[173,113,173,126],[173,127,173,140],[43,11,43,15],[44,11,44,15],[45,11,45,15],[46,11,46,15],[173,16,173,23],[173,24,173,41],[37,11,37,15],[38,11,38,15],[39,11,39,15],[40,11,40,15],[42,11,42,15],[31,11,31,15],[32,11,32,15],[33,11,33,15],[34,11,34,15],[47,2,47,10],[47,11,47,15],[47,16,47,23],[47,24,47,41],[44,2,44,10],[44,16,44,23],[44,24,44,41],[41,2,41,10],[41,16,41,23],[41,24,41,41],[48,2,48,10],[48,11,48,15],[48,16,48,23],[48,24,48,41],[48,42,48,59],[48,60,48,77],[48,78,48,98],[48,99,48,112],[48,113,48,126],[49,16,49,23],[49,24,49,41],[49,42,49,59],[49,60,49,77],[49,78,49,98],[49,99,49,112],[49,113,49,126],[47,113,47,126],[47,127,47,140],[48,127,48,140],[10,2,10,114],[51,127,51,140],[51,2,51,10],[51,11,51,15],[51,16,51,23],[51,24,51,41],[51,42,51,59],[51,60,51,77],[51,78,51,98],[51,99,51,112],[51,113,51,126],[49,127,49,140],[50,2,50,10],[50,11,50,15],[50,16,50,23],[50,24,50,41],[50,42,50,59],[50,60,50,77],[50,78,50,98],[50,99,50,112],[50,113,50,126],[50,127,50,140],[49,2,49,10],[49,11,49,15]]}
[]
[]
[]
[]
[]
[]
[]
[]
[null,null,"This section is used to indicate the names of individuals at the regional and headquarters level who provide HR oversight for each survey country."]
[]
[null,null,"When finished, use the buttons to navigate to the next contacts sheet or return to the Order Form."]
[]
[]
[]
[]
[]
[]
[null,null,"Headquarters and Regional Contacts"]
[]
[null,null,"Please indicate below, for each country in which you registered, the contact information for the HR Leaders at the regional and headquarters level  who are responsible for each country.  If you need more space, click the Add Another Row button.   If there is just one individual, please copy the necessary information for each country."]
[]
[null,null,1,2,3,4,5,6,7,8,9,null,11,12,13,14,18,19,20,21,22,23,24,25,26,27,28,29,30,31,32,33,34,35,36,37,38,39,40,41,42,43,44,45,46,47,48,49,50,51,52,53,54,55,56,57,58,59,60,61,62,63,64,65,66,67,68,69,70,71,72,73,74,75,76,77,78,79,80,81,82,83,84,85,86,87,88,89,90,91,92,93,94,95,96,97,98,99,100,101,102,103,104,105,106,107,108,109,110,111,112,113,114,115,116,117,118,119,120,121,122,123,124,125,126,127,128,129,130,131,132,133,134]
[]
[null,null,{"$f":"COLUMN(C24)-2","v":1},null,null,null,null,null,null,null,null,{"$f":"COLUMN(L24)-2","v":10},null,null,null,null,{"$f":"COLUMN(Q24)-2","v":15},null,null,null,null,null,null,null,{"$f":"COLUMN(Y24)-2","v":23},null,null,null,null,null,null,null,null,null,null,null,null,null,null,null,null,null,{"$f":"COLUMN(AQ24)-2","v":41},null,null,null,null,null,null,null,null,null,null,null,null,null,null,null,null,null,{"$f":"COLUMN(BI24)-2","v":59},null,null,null,null,null,null,null,null,null,null,null,null,null,null,null,null,null,{"$f":"COLUMN(CA24)-2","v":77},null,null,null,null,null,null,null,null,null,null,null,null,null,null,null,null,null,null,null,null,{"$f":"COLUMN(CV24)-2","v":98},null,null,null,null,null,null,null,null,null,null,null,null,null,{"$f":"COLUMN(DJ24)-2","v":112},null,null,null,null,null,null,null,null,null,null,null,null,null,{"$f":"COLUMN(DX24)-2","v":126}]
[null,null,"Survey Country",null,null,null,null,null,null,null,null,"HQ or Reg",null,null,null,null,"Salutation",null,null,null,null,null,null,null,"First or Given Name",null,null,null,null,null,null,null,null,null,null,null,null,null,null,null,null,null,"Last or Surname(s)",null,null,null,null,null,null,null,null,null,null,null,null,null,null,null,null,null,"Job Title",null,null,null,null,null,null,null,null,null,null,null,null,null,null,null,null,null,"Phone Number (including country code)",null,null,null,null,null,null,null,null,null,null,null,null,null,null,null,null,null,null,null,null,"E-mail Address",null,null,null,null,null,null,null,null,null,null,null,null,null,"Skype Name",null,null,null,null,null,null,null,null,null,null,null,null,null,"Country Where Located"]

{"sheet":"QueryResult","index":13,"n_rows":62,"n_cols":8,"rows_kept":62,"cut":false,"hidden":true,"merged":[]}
["Region","Country","Type x to Select",null,"All Countries",null,"Last Row of Countries",{"$f":"TotalIndigo","v":0}]
[null,null,null,null,"Country",{"$f":"VLOOKUP(E2,SurveyElections,3,FALSE)","v":"ISO-3"}]
[null,null,null,null,null,{"$error":"#N/A"}]
[null,null,null,null,null,{"$error":"#N/A"}]
[null,null,null,null,null,{"$error":"#N/A"}]
[null,null,null,null,null,{"$error":"#N/A"}]
[null,null,null,null,null,{"$error":"#N/A"}]
[null,null,null,null,null,{"$error":"#N/A"}]
[null,null,null,null,null,{"$error":"#N/A"}]
[null,null,null,null,null,{"$error":"#N/A"}]
[null,null,null,null,null,{"$error":"#N/A"}]
[null,null,null,null,null,{"$error":"#N/A"}]
[null,null,null,null,null,{"$error":"#N/A"}]
[null,null,null,null,null,{"$error":"#N/A"}]
[null,null,null,null,null,{"$error":"#N/A"}]
[null,null,null,null,null,{"$error":"#N/A"}]
[null,null,null,null,null,{"$error":"#N/A"}]
[null,null,null,null,null,{"$error":"#N/A"}]
[null,null,null,null,null,{"$error":"#N/A"}]
[null,null,null,null,null,{"$error":"#N/A"}]
[null,null,null,null,null,{"$error":"#N/A"}]
[null,null,null,null,null,{"$error":"#N/A"}]
[null,null,null,null,null,{"$error":"#N/A"}]
[null,null,null,null,null,{"$error":"#N/A"}]
[null,null,null,null,null,{"$error":"#N/A"}]
[null,null,null,null,null,{"$error":"#N/A"}]
[null,null,null,null,null,{"$error":"#N/A"}]
[null,null,null,null,null,{"$error":"#N/A"}]
[null,null,null,null,null,{"$error":"#N/A"}]
[null,null,null,null,null,{"$error":"#N/A"}]
[null,null,null,null,null,{"$error":"#N/A"}]
[null,null,null,null,null,{"$error":"#N/A"}]
[null,null,null,null,null,{"$error":"#N/A"}]
[null,null,null,null,null,{"$f":"VLOOKUP(E34,SurveyElections,3,FALSE)","v":{"$error":"#N/A"}}]
[null,null,null,null,null,{"$error":"#N/A"}]
[null,null,null,null,null,{"$error":"#N/A"}]
[null,null,null,null,null,{"$error":"#N/A"}]
[null,null,null,null,null,{"$error":"#N/A"}]
[null,null,null,null,null,{"$error":"#N/A"}]
[null,null,null,null,null,{"$error":"#N/A"}]
[null,null,null,null,null,{"$error":"#N/A"}]
[null,null,null,null,null,{"$error":"#N/A"}]
[null,null,null,null,null,{"$error":"#N/A"}]
[null,null,null,null,null,{"$error":"#N/A"}]
[null,null,null,null,null,{"$error":"#N/A"}]
[null,null,null,null,null,{"$error":"#N/A"}]
[null,null,null,null,null,{"$error":"#N/A"}]
[null,null,null,null,null,{"$error":"#N/A"}]
[null,null,null,null,null,{"$error":"#N/A"}]
[null,null,null,null,null,{"$error":"#N/A"}]
[null,null,null,null,null,{"$error":"#N/A"}]
[null,null,null,null,null,{"$error":"#N/A"}]
[null,null,null,null,null,{"$error":"#N/A"}]
[null,null,null,null,null,{"$error":"#N/A"}]
[null,null,null,null,null,{"$error":"#N/A"}]
[null,null,null,null,null,{"$error":"#N/A"}]
[null,null,null,null,null,{"$error":"#N/A"}]
[null,null,null,null,null,{"$error":"#N/A"}]
[null,null,null,null,null,{"$error":"#N/A"}]
[null,null,null,null,null,{"$error":"#N/A"}]
[null,null,null,null,null,{"$error":"#N/A"}]
[null,null,null,null,null,{"$error":"#N/A"}]

{"sheet":"BG Use Only","index":14,"n_rows":237,"n_cols":5,"rows_kept":237,"cut":false,"hidden":true,"merged":[]}
["State",null,"Country","Select","Salutation"]
["US States",null,"United States","X","Mr"]
["Alabama","AL","Afghanistan",null,"Ms"]
["Alaska","AK","Albania",null,"Mrs"]
["Arizona","AZ","Algeria",null,"Dr"]
["Arkansas","AR","American Samoa"]
["California","CA","Andorra"]
["Colorado","CO","Angola",null,"Development"]
["Connecticut","CT","Anguilla","SurveyChoice","Education"]
["DC","DC","Antarctica","NGO Local Pay Survey","Environment"]
["Delaware","DE","Antigua And Barbuda","Multi-sector add-on","Human Rights"]
["Florida","FL","Argentina",null,"Humanitarian"]
["Georgia","GA","Armenia",null,"Microfinance"]
["Hawaii","HI","Aruba",null,"Public Health"]
["Idaho","ID","Australia","Yes"]
["Illinois","IL","Austria","No"]
["Indiana","IN","Azerbaijan"]
["Iowa","IA","Bahamas",1]
["Kansas","KS","Bahrain",3]
["Kentucky","KY","Bangladesh","Type of Organization"]
["Louisiana","LA","Barbados","NGO",1]
["Maine","ME","Belarus","Commercial Development Org or Other Non-Profit",2]
["Maryland","MD","Belgium"]
["Massachusetts","MA","Belize"]
["Michigan","MI","Benin","Annual"]
["Minnesota","MN","Bermuda","Every 2 Years"]
["Mississippi","MS","Bhutan","Ah-hoc/Irregular"]
["Missouri","MO","Bolivia"]
["Montana","MT","Bosnia And Herzegovina","Regional"]
["Nebraska","NE","Botswana","Headquarters"]
["Nevada","NV","Bouvet Island"]
["New Hampshire","NH","Brazil"]
["New Jersey","NJ","British Indian Ocean Territory"]
["New Mexico","NM","Brunei Darussalam"]
["New York","NY","Bulgaria"]
["North Carolina","NC","Burkina Faso"]
["North Dakota","ND","Burundi"]
["Ohio","OH","Cambodia"]
["Oklahoma","OK","Cameroon"]
["Oregon","OR","Canada"]
["Pennsylvania","PA","Cape Verde"]
["Rhode Island","RI","Cayman Islands"]
["South Carolina","SC","Central African Republic"]
["South Dakota","SD","Chad"]
["Tennessee","TN","Chile"]
["Texas","TX","China"]
["Utah","UT","Christmas Island"]
["Vermont","VT","Cocos (Keeling) Islands"]
["Virginia","VA","Colombia"]
["Washington","WA","Comoros"]
["West Virginia","WV","Congo, DR"]
["Wisconsin","WI","Congo, Republic of"]
["Wyoming","WY","Cook Islands"]
["Canadian Provinces and Territories",null,"Costa Rica"]
["Alberta","AB","Cote D'Ivoire"]
["British Columbia","BC","Croatia"]
["Manitoba","MB","Cuba"]
["New Brunswick","NB","Cyprus"]
["Newfoundland","NL","Czech Republic"]
["Northwest Territories","NT","Denmark"]
["Nova Scotia","NS","Djibouti"]
["Nunavut","NU","Dominica"]
["Ontario","ON","Dominican Republic"]
["Prince Edward Island","PE","Ecuador"]
["Quebec","QC","Egypt"]
["Saskatchewan","SK","El Salvador"]
["Yukon Territory","YT","Equatorial Guinea"]
[null,null,"Eritrea"]
[null,null,"Estonia"]
[null,null,"Eswatini"]
[null,null,"Ethiopia"]
[null,null,"Falkland Islands"]
[null,null,"Faroe Islands"]
[null,null,"Fiji"]
[null,null,"Finland"]
[null,null,"France"]
[null,null,"French Guiana"]
[null,null,"French Polynesia"]
[null,null,"French Southern Territories"]
[null,null,"Gabon"]
[null,null,"Gambia"]
[null,null,"Georgia"]
[null,null,"Germany"]
[null,null,"Ghana"]
[null,null,"Gibraltar"]
[null,null,"Greece"]
[null,null,"Greenland"]
[null,null,"Grenada"]
[null,null,"Guadeloupe"]
[null,null,"Guam"]
[null,null,"Guatemala"]
[null,null,"Guinea"]
[null,null,"Guinea-Bissau"]
[null,null,"Guyana"]
[null,null,"Haiti"]
[null,null,"Heard Island & Mcdonald Islands"]
[null,null,"Honduras"]
[null,null,"Hong Kong"]
[null,null,"Hungary"]
[null,null,"Iceland"]
[null,null,"India"]
[null,null,"Indonesia"]
[null,null,"Iran"]
[null,null,"Iraq"]
[null,null,"Ireland"]
[null,null,"Israel"]
[null,null,"Italy"]
[null,null,"Jamaica"]
[null,null,"Japan"]
[null,null,"Jordan"]
[null,null,"Kazakhstan"]
[null,null,"Kenya"]
[null,null,"Kiribati"]
[null,null,"Korea, Republic Of"]
[null,null,"Kuwait"]
[null,null,"Kyrgyzstan"]
[null,null,"Lao"]
[null,null,"Latvia"]
[null,null,"Lebanon"]
[null,null,"Lesotho"]
[null,null,"Liberia"]
[null,null,"Libya"]
[null,null,"Liechtenstein"]
[null,null,"Lithuania"]
[null,null,"Luxembourg"]
[null,null,"Macau"]
[null,null,"Madagascar"]
[null,null,"Malawi"]
[null,null,"Malaysia"]
[null,null,"Maldives"]
[null,null,"Mali"]
[null,null,"Malta"]
[null,null,"Marshall Islands"]
[null,null,"Martinique"]
[null,null,"Mauritania"]
[null,null,"Mauritius"]
[null,null,"Mayotte"]
[null,null,"Mexico"]
[null,null,"Micronesia"]
[null,null,"Moldova"]
[null,null,"Monaco"]
[null,null,"Mongolia"]
[null,null,"Montserrat"]
[null,null,"Morocco"]
[null,null,"Mozambique"]
[null,null,"Myanmar"]
[null,null,"Namibia"]
[null,null,"Nauru"]
[null,null,"Nepal"]
[null,null,"Netherlands"]
[null,null,"Netherlands Antilles"]
[null,null,"New Caledonia"]
[null,null,"New Zealand"]
[null,null,"Nicaragua"]
[null,null,"Niger"]
[null,null,"Nigeria"]
[null,null,"Niue"]
[null,null,"Norfolk Island"]
[null,null,"North Macedonia"]
[null,null,"Northern Mariana Islands"]
[null,null,"Norway"]
[null,null,"Oman"]
[null,null,"Pakistan"]
[null,null,"Palau"]
[null,null,"Panama"]
[null,null,"Papua New Guinea"]
[null,null,"Paraguay"]
[null,null,"Peru"]
[null,null,"Philippines"]
[null,null,"Pitcairn"]
[null,null,"Poland"]
[null,null,"Portugal"]
[null,null,"Puerto Rico"]
[null,null,"Qatar"]
[null,null,"Reunion"]
[null,null,"Romania"]
[null,null,"Russian Federation"]
[null,null,"Rwanda"]
[null,null,"Saint Helena"]
[null,null,"Saint Kitts And Nevis"]
[null,null,"Saint Lucia"]
[null,null,"Saint Pierre And Miquelon"]
[null,null,"Saint Vincent And The Grenadines"]
[null,null,"Samoa"]
[null,null,"San Marino"]
[null,null,"Sao Tome And Principe"]
[null,null,"Saudi Arabia"]
[null,null,"Senegal"]
[null,null,"Serbia"]
[null,null,"Seychelles"]
[null,null,"Sierra Leone"]
[null,null,"Singapore"]
[null,null,"Slovak Republic"]
[null,null,"Slovenia"]
[null,null,"Solomon Islands"]
[null,null,"Somalia"]
[null,null,"South Africa"]
[null,null,"South Sudan"]
[null,null,"Spain"]
[null,null,"Sri Lanka"]
[null,null,"Sudan"]
[null,null,"Suriname"]
[null,null,"Svalbard And Jan Mayen Islands"]
[null,null,"Sweden"]
[null,null,"Switzerland"]
[null,null,"Syria"]
[null,null,"Taiwan"]
[null,null,"Tajikistan"]
[null,null,"Tanzania"]
[null,null,"Thailand"]
[null,null,"Togo"]
[null,null,"Tokelau"]
[null,null,"Tonga"]
[null,null,"Trinidad And Tobago"]
[null,null,"Tunisia"]
[null,null,"Turkey"]
[null,null,"Turkmenistan"]
[null,null,"Turks And Caicos Islands"]
[null,null,"Tuvalu"]
[null,null,"Uganda"]
[null,null,"Ukraine"]
[null,null,"United Arab Emirates"]
[null,null,"United Kingdom"]
[null,null,"United States Minor Outlying Islands"]
[null,null,"Uruguay"]
[null,null,"Uzbekistan"]
[null,null,"Vanuatu"]
[null,null,"Vatican City State (Holy See)"]
[null,null,"Venezuela"]
[null,null,"Viet Nam"]
[null,null,"Virgin Islands (British)"]
[null,null,"Virgin Islands (U.S.)"]
[null,null,"Wallis And Futuna Islands"]
[null,null,"Western Sahara"]
[null,null,"Yemen"]
[null,null,"Zambia"]
[null,null,"Zimbabwe"]

{"sheet":"Invoices","index":15,"n_rows":14,"n_cols":7,"rows_kept":14,"cut":false,"hidden":true,"merged":[[0,0,0,13]]}
["This sheet is used to create export files for QuickBooks Invoicing"]
[]
[]
[null,"Step 1","Review the Order Form and ensure all sections are completed.  If necessary, contact client to confirm any corrections."]
[]
[null,"Step 2","Select the export parameters (all values should be automatically populated):"]
[]
[null,null,"a)","Type of Registration",null,{"$f":"ProductOption","v":"Product Option"}]
[null,null,"b)","Type of Client",null,{"$f":"OrgType1","v":"Type of Organization"},{"$f":"IF(AND(F8=\"Ad-Hoc Subscriber\",F9=\"NGO\"),\"Order Form (Ad-Hoc)\",IF(AND(F8=\"Ad-Hoc Subscriber\",F9<>\"NGO\"),\"Order Form (Ad-Hoc CDO)\",IF(F8=\"Sustaining Contributor\",\"Order Form (SC)\",\"Order Form (SP)\")))","v":"Order Form (SP)"}]
[null,null,"c)","Name of Client",null,{"$f":"IF(ISBLANK(BillingOrgName),OrgName,BillingOrgName)","v":0},"This must be entered on the Order Form TAB"]
[null,null,"d)","Order Number",null,{"$f":"OrderNumber","v":0},"This must be entered on the Order Form TAB"]
[null,null,"e)","Customer Number",null,{"$f":"AccountNumber","v":0},"This must be entered on the Order Form TAB"]
[]
[null,"Step 3","Run the Export to QuickBooks Macro to create a new file with the data needed to invoice by clicking the button below."]

{"sheet":"SO Notification","index":16,"n_rows":87,"n_cols":17,"rows_kept":87,"cut":false,"hidden":true,"merged":[[0,0,0,13],[23,3,34,6],[51,11,51,16],[62,10,62,16],[60,11,60,16]]}
["This sheet is used to create export files for notification email to Survey Operations"]
[]
[]
[null,"Step 1","Review the Order Form and ensure all sections are completed.  If necessary, contact client to confirm any corrections."]
[]
[null,"Step 2","Select the export parameters (fields 2a through 2d should be automatically populated):"]
[]
[null,null,"a)","Type of Registration",null,{"$f":"ProductOption","v":"Product Option"},{"$f":"IF(F8=\"Ad-Hoc Subscriber\",\"Order Form (Ad-Hoc)\",IF(F8=\"Sustaining Contributor\",\"Order Form (SC)\",\"Order Form (SP)\"))","v":"Order Form (SP)"}]
[null,null,"b)","Name of Client",null,{"$f":"IF(ISBLANK(BillingOrgName),OrgName,BillingOrgName)","v":0},"This field must be entered on the Order Form Tab"]
[null,null,"c)","Order Number",null,{"$f":"IF(ISBLANK(OrderNumber),\"\",OrderNumber)","v":""},"This field must be entered on the Order Form Tab"]
[null,null,"d)","Account Number",null,{"$f":"AccountNumber","v":0},"This field must be entered on the Order Form Tab"]
[]
[null,"Step 3","Indicate in the following fields additional information required by survey operations (entries in yellow cells only):"]
[]
[null,null,"a)","Survey Type:"]
[null,null,"b)","Participation Type:",null,null,{"$f":"IF(F16=\"Update (treat as NEW)\",\"Last Participation Year:    \",\"\")","v":""},null,"<----- If Update (treat as NEW), enter last participation year in H16; otherwise, leave blank"]
[null,null,"c)","Registration Type:"]
[null,null,"d)","Language:"]
[null,null,"e)","SDM:",null,null,"(enter name if applicable; otherwise leave blank)"]
[null,null,"f)","DA Action:"]
[]
[null,null,"g)","Special Notes (enter special notes in box below):"]
[]
[]
[]
[]
[]
[]
[]
[]
[]
[]
[]
[]
[]
[]
[null,"Step 3","Click the button below to create a new file with the data needed for survey operations notification email."]
[]
[]
[]
[]
[]
[]
[]
[]
[]
[]
[null,null,null,null,null,null,null,null,null,"Export for SO"]
[]
[]
[null,null,null,null,null,null,null,null,null,1,"Employer Name:",{"$f":"OrgName","v":0}]
[null,null,null,null,null,null,null,null,null,2,"Countries:",{"$f":"_xlfn.TEXTJOIN(\"; \",TRUE,QueryResult!E2:E61)","v":"Country"}]
[]
[null,null,null,null,null,null,null,null,null,3,"Survey Type: ",{"$f":"SurveyTypeChoice","v":0}]
[null,null,null,null,null,null,null,null,null,4,"Participation Type:",{"$f":"ParticipationTypeChoice","v":0},null,{"$f":"IF(ISBLANK(LastPartYear),\"\",\"Last Participation Year: \"&LastPartYear)","v":""}]
[null,null,null,null,null,null,null,null,null,5,"Registration Type:",{"$f":"RegistrationTypeChoice","v":0}]
[null,null,null,null,null,null,null,null,null,6,"Language:",{"$f":"LanguageTypeChoice","v":0}]
[null,null,null,null,null,null,null,null,null,7,"Account Executive:",{"$f":"SalesRep","v":0}]
[null,null,null,null,null,null,null,null,null,8,"Survey Data Manager:",{"$f":"IF(ISBLANK(SDMName),\"\",SDMName)","v":""}]
[null,null,null,null,null,null,null,null,null,9,"Action for Data Analyst",{"$f":"DAActionChoice","v":0}]
[null,null,null,null,null,null,null,null,null,10,"Special Notes:",{"$f":"SpecialNotesText","v":0}]
[]
[null,null,null,null,null,null,null,null,null,11,"Data Contact Information"]
[null,null,null,null,null,null,null,null,null,null,"Countries:","ISO","Name","Title","Location","Email","Phone"]
[null,null,null,null,null,null,null,null,26,null,{"$f":"IF(ISBLANK('Survey Contacts'!C26),\"\",'Survey Contacts'!C26)","v":""},{"$f":"IF(ISERROR(IF(K65=\"All Countries\",\"All\",VLOOKUP(K65,SurveyElections,3,FALSE))),\"\",IF(K65=\"All Countries\",\"All\",VLOOKUP(K65,SurveyElections,3,FALSE)))","v":""},{"$f":"IF(L65=\"\",\"\",_xlfn.TEXTJOIN(\" \",TRUE,VLOOKUP(I65&K65,SurveyDataContacts,11,FALSE),VLOOKUP(I65&K65,SurveyDataContacts,19,FALSE),VLOOKUP(I65&K65,SurveyDataContacts,37,FALSE)))","v":""},{"$f":"IF(L65=\"\",\"\",VLOOKUP(I65&K65,SurveyDataContacts,55,FALSE))","v":""},{"$f":"IF(L65=\"\",\"\",VLOOKUP(I65&K65,SurveyDataContacts,122,FALSE))","v":""},{"$f":"IF(L65=\"\",\"\",VLOOKUP(I65&K65,SurveyDataContacts,94,FALSE))","v":""},{"$f":"IF(L65=\"\",\"\",VLOOKUP(I65&K65,SurveyDataContacts,73,FALSE))","v":""}]
[null,null,null,null,null,null,null,null,27,null,{"$f":"IF(ISBLANK('Survey Contacts'!C27),\"\",'Survey Contacts'!C27)","v":""},{"$f":"IF(ISERROR(IF(K66=\"All Countries\",\"All\",VLOOKUP(K66,SurveyElections,3,FALSE))),\"\",IF(K66=\"All Countries\",\"All\",VLOOKUP(K66,SurveyElections,3,FALSE)))","v":""},"","","","",""]
[null,null,null,null,null,null,null,null,28,null,{"$f":"IF(ISBLANK('Survey Contacts'!C28),\"\",'Survey Contacts'!C28)","v":""},"","","","","",""]
[null,null,null,null,null,null,null,null,29,null,{"$f":"IF(ISBLANK('Survey Contacts'!C29),\"\",'Survey Contacts'!C29)","v":""},"","","","","",""]
[null,null,null,null,null,null,null,null,30,null,{"$f":"IF(ISBLANK('Survey Contacts'!C30),\"\",'Survey Contacts'!C30)","v":""},{"$f":"IF(ISERROR(IF(K69=\"All Countries\",\"All\",VLOOKUP(K69,SurveyElections,3,FALSE))),\"\",IF(K69=\"All Countries\",\"All\",VLOOKUP(K69,SurveyElections,3,FALSE)))","v":""},"","","","",""]
[null,null,null,null,null,null,null,null,31,null,{"$f":"IF(ISBLANK('Survey Contacts'!C31),\"\",'Survey Contacts'!C31)","v":""},"","","","","",""]
[null,null,null,null,null,null,null,null,32,null,{"$f":"IF(ISBLANK('Survey Contacts'!C32),\"\",'Survey Contacts'!C32)","v":""},"","","","","",""]
[null,null,null,null,null,null,null,null,33,null,{"$f":"IF(ISBLANK('Survey Contacts'!C33),\"\",'Survey Contacts'!C33)","v":""},"","","","","",""]
[null,null,null,null,null,null,null,null,34,null,{"$f":"IF(ISBLANK('Survey Contacts'!C34),\"\",'Survey Contacts'!C34)","v":""},"","","","","",""]
[null,null,null,null,null,null,null,null,35,null,{"$f":"IF(ISBLANK('Survey Contacts'!C35),\"\",'Survey Contacts'!C35)","v":""},"","","","","",""]
[null,null,null,null,null,null,null,null,36,null,{"$f":"IF(ISBLANK('Survey Contacts'!C36),\"\",'Survey Contacts'!C36)","v":""},"","","","","",""]
[null,null,null,null,null,null,null,null,37,null,{"$f":"IF(ISBLANK('Survey Contacts'!C37),\"\",'Survey Contacts'!C37)","v":""},"","","","","",""]
[null,null,null,null,null,null,null,null,38,null,{"$f":"IF(ISBLANK('Survey Contacts'!C38),\"\",'Survey Contacts'!C38)","v":""},"","","","","",""]
[null,null,null,null,null,null,null,null,39,null,{"$f":"IF(ISBLANK('Survey Contacts'!C39),\"\",'Survey Contacts'!C39)","v":""},"","","","","",""]
[null,null,null,null,null,null,null,null,40,null,{"$f":"IF(ISBLANK('Survey Contacts'!C40),\"\",'Survey Contacts'!C40)","v":""},"","","","","",""]
[null,null,null,null,null,null,null,null,41,null,{"$f":"IF(ISBLANK('Survey Contacts'!C41),\"\",'Survey Contacts'!C41)","v":""},"","","","","",""]
[null,null,null,null,null,null,null,null,42,null,{"$f":"IF(ISBLANK('Survey Contacts'!C42),\"\",'Survey Contacts'!C42)","v":""},"","","","","",""]
[null,null,null,null,null,null,null,null,43,null,{"$f":"IF(ISBLANK('Survey Contacts'!C43),\"\",'Survey Contacts'!C43)","v":""},"","","","","",""]
[null,null,null,null,null,null,null,null,44,null,{"$f":"IF(ISBLANK('Survey Contacts'!C44),\"\",'Survey Contacts'!C44)","v":""},"","","","","",""]
[null,null,null,null,null,null,null,null,45,null,{"$f":"IF(ISBLANK('Survey Contacts'!C45),\"\",'Survey Contacts'!C45)","v":""},"","","","","",""]
[null,null,null,null,null,null,null,null,46,null,{"$f":"IF(ISBLANK('Survey Contacts'!C46),\"\",'Survey Contacts'!C46)","v":""},"","","","","",""]
[null,null,null,null,null,null,null,null,47,null,{"$f":"IF(ISBLANK('Survey Contacts'!C47),\"\",'Survey Contacts'!C47)","v":""},"","","","","",""]
[null,null,null,null,null,null,null,null,48,null,{"$f":"IF(ISBLANK('Survey Contacts'!C48),\"\",'Survey Contacts'!C48)","v":""},"","","","","",""]

{"sheet":"RegDataBase","index":17,"n_rows":13,"n_cols":7,"rows_kept":13,"cut":false,"hidden":true,"merged":[[0,0,0,13]]}
["This sheet is used to create export files for the Registration Database"]
[]
[]
[null,"Step 1","Review the Order Form and ensure all sections are completed.  If necessary, contact client to confirm any corrections."]
[]
[null,"Step 2","Select the export parameters (all fields should be automatically populated):"]
[]
[null,null,"a)","Type of Registration",null,{"$f":"ProductOption","v":"Product Option"},{"$f":"IF(F8=\"Ad-Hoc Subscriber\",\"Order Form (Ad-Hoc)\",IF(F8=\"Sustaining Contributor\",\"Order Form (SC)\",\"Order Form (SP)\"))","v":"Order Form (SP)"}]
[null,null,"b)","Name of Client",null,{"$f":"IF(ISBLANK(BillingOrgName),OrgName,BillingOrgName)","v":0},"This field must be entered on the Order Form Tab"]
[null,null,"c)","Order Number",null,{"$f":"OrderNumber","v":0},"This field must be entered on the Order Form Tab"]
[null,null,"d)","Account Number",null,{"$f":"AccountNumber","v":0},"This field must be entered on the Order Form Tab"]
[]
[null,"Step 3","Run the Create RegDataBase Macro to create a new file with the data needed to invoice by clicking the button below."]

{"sheet":"BG Use Only 2","index":18,"n_rows":183,"n_cols":18,"rows_kept":183,"cut":false,"hidden":true,"merged":[]}
[]
["Table Below is called ","SurveyElections"]
["When new countries are added, this table must be edited to reflect the new information in column B."]
["Column C is a formula for NGO countries, hardcoded as \"Does Not Apply\" for multi-sector countries."]
["Colors are not significant in Column B - just added for easy reading"]
["In Column C, red values are formula-driven; black is hard coded.",null,null,null,null,null,null,"PriorPrice  Flag (2=Yes)"]
[null,null,null,null,null,null,null,{"$f":"IF(PriorPrice=\"Yes\",2,0)","v":0}]
[]
["Country","Availability","ISO-3"]
["Afghanistan","NGOLP & Multisector","AFG",null,null,null,null,"Fees Updated October 2019",null,null,null,null,"CDO Pricing",null,null,null,"Enter Selection"]
["Albania","Multisector only","ALB",null,null,null,null,null,null,null,"Prior",null,null,null,null,null,"Yes (Participant)"]
["Algeria","Multisector only","DZA",null,null,null,null,"Product","NGO","CDO","NGO","CDO",0,null,2000,null,"Yes (Non-participant)"]
["Angola","NGOLP & Multisector","AGO",null,null,null,null,"Report Subscription",1295,1750,null,null,10,1620,1800,null,"No"]
["Argentina","Multisector only","ARG",null,null,null,null,"Multi-sector add-on",200,250]
["Armenia","NGOLP & Multisector","ARM",null,null,null,null,"3-Yr-Year 1",{"$f":"I13","v":1295},1750,895,1500]
["Azerbaijan","Multisector only","AZE",null,null,null,null,"3-Yr-Year 2",{"$f":"I13","v":1295},1750,895,1500]
["Bahamas","Multisector only","BHS",null,null,null,null,"3 Yr-Year 3",845,1000,445,600]
["Bahrain","Multisector only","BHR",null,null,null,null,"Sustaining Partner",850,1275,650]
["Bangladesh","NGOLP & Multisector","BGD"]
["Barbados","Multisector only","BRB",null,null,null,null,"NGO Global Pay",{"$f":"IF(NGOGPChoice=\"no\",0,IF(NGOGPChoice=\"NGO Global Pay Selection\",0,IF(OR(ProductOption=\"Sustaining Partner\",ProductOption=\"Sustaining Contributor\"),1500,1725)))","v":0}]
["Belarus","Multisector only","BLR",null,null,null,null,"Expedited Report Fee",450,null,null,null,0,2000,"=VLOOKUP(TotalIndigo,CDOMultiCountry,2,TRUE)"]
["Belgium","NGOLP & Multisector","BLZ",null,null,null,null,null,null,null,null,null,10,1800]
["Belize","Multisector only","BEN",null,null,null,null,null,null,null,null,null,25,1700]
["Benin","NGOLP & Multisector","BEL",null,null,null,null,"Indigo",205,{"$f":"IF(ProductOption=\"Sustaining Contributor\",250,VLOOKUP(COUNTA('Order Form (Ad-Hoc CDO)'!$D$54:$D$113),CDOSPPrice,3,TRUE))","v":2000},null,null,35,1600]
["Bermuda","Multisector only","BMU",null,null,null,null,"Sub-sector cut",null,null,null,null,45,1400]
["Bhutan","Multisector only","BTN",null,null,null,null,"Custom cut",400,400]
["Bolivia","NGOLP & Multisector","BOL"]
["Bosnia and Herzegovina","NGOLP & Multisector","BIH"]
["Botswana","NGOLP & Multisector","BWA"]
["Brazil","NGOLP & Multisector","BRA",null,null,null,null,"Fees for this client:",null,{"$f":"VLOOKUP('Order Form'!L101,PriceTest,2,FALSE)","v":{"$error":"#N/A"}}]
["British Virgin Islands","Multisector only","VGB",null,null,null,null,"Report Subscription",{"$f":"VLOOKUP(H31,FeeSchedule,$J$30+1,FALSE)","v":{"$error":"#N/A"}},null,null,"COUNTRY","Tax Rate for Services",null,null,null,"Currency"]
["Brunei","Multisector only","BRN",null,null,null,null,"Multi-sector add-on",{"$f":"VLOOKUP(H32,FeeSchedule,1+$J$30,FALSE)","v":{"$error":"#N/A"}},null,null,null,null,null,null,null,"USD"]
["Bulgaria","Multisector only","BGR",null,null,null,null,"3-Yr-Year 1",{"$f":"VLOOKUP(H33,FeeSchedule,1+$J$30+AdjustPrior,FALSE)","v":{"$error":"#N/A"}},null,null,"Chad",0.25,null,null,null,"EUR"]
["Burkina Faso","NGOLP & Multisector","BFA",null,null,null,null,"3-Yr-Year 2",{"$f":"VLOOKUP(H34,FeeSchedule,1+$J$30+AdjustPrior,FALSE)","v":{"$error":"#N/A"}},null,null,"Burkina Faso",0.2,null,null,null,"GBP"]
["Burundi","NGOLP & Multisector","BDI",null,null,null,null,"3 Yr-Year 3",{"$f":"VLOOKUP(H35,FeeSchedule,1+$J$30+AdjustPrior,FALSE)","v":{"$error":"#N/A"}},null,null,"Cambodia",0.14000000000000001,null,null,null,"CAD"]
["Cambodia","NGOLP & Multisector","KHM",null,null,null,null,"Sustaining Partner",{"$f":"VLOOKUP(H36,FeeSchedule,1+$J$30+AdjustPrior,FALSE)","v":{"$error":"#N/A"}},null,null,"China",6.7900000000000002E-2]
["Cameroon","NGOLP & Multisector","CMR",null,null,null,null,"Indigo",{"$error":"#N/A"},null,null,"Ethiopia",0.15]
["Canada","NGOLP Only","CAN",null,null,null,null,"Sub-sector cut",{"$error":"#N/A"},null,null,"Gabon",0.1]
["Cape Verde","Multisector only","CPV",null,null,null,null,"Custom cut",{"$f":"VLOOKUP(H39,FeeSchedule,1+$J$30,FALSE)*IF(ProductOption=\"Sustaining Partner\",0.5,1)","v":{"$error":"#N/A"}},null,null,"Ghana",0.2,null,null,null,"DataCycles"]
["Cayman Islands","Multisector only","CYM",null,null,null,null,"3-Yr-Average",{"$f":"AVERAGE(I33:I35)","v":{"$error":"#N/A"}},null,null,"Haiti",0.2,null,null,null,"January","Cycle 1"]
["Central African Republic","NGOLP & Multisector","CAF",null,null,null,null,null,null,null,null,"India",0.3,null,null,null,"February","Cycle 1"]
["Chad","NGOLP & Multisector","TCD",null,null,null,null,null,null,null,null,"Kenya",0.2,null,null,null,"March","Cycle 2"]
["Chile","NGOLP & Multisector","CHL",null,null,null,null,null,null,null,null,"Laos",0.1,null,null,null,"April","Cycle 2"]
["China","NGOLP & Multisector","CHN",null,null,null,null,"Cycle 1 (Apr)",null,null,null,"Lebanon",7.4999999999999997E-2,null,null,null,"May","Cycle 2"]
["Colombia","NGOLP & Multisector","COL",null,null,null,null,"Cycle 2 (Jul)",null,null,null,"Malawi",0.15,null,null,null,"June","Cycle 3"]
["Comoros","Multisector only","COM",null,null,null,null,"Cycle 3 (Oct)",null,null,null,"Mongolia",0.2,null,null,null,"July","Cycle 3"]
["Congo, DR","NGOLP & Multisector","COD",null,null,null,null,"All Cycles",null,null,null,"Mozambique",0.15,null,null,null,"August","Cycle 3"]
["Congo, Republic of the","Multisector only","COG",null,null,null,null,null,null,null,null,"Nicaragua",0.15,null,null,null,"September","Cycle 1"]
["Costa Rica","NGOLP & Multisector","CRI",null,null,null,null,null,null,null,null,"Pakistan",0.15,null,null,null,"October","Cycle 1"]
["Cote d'Ivoire","NGOLP & Multisector","CIV",null,null,null,null,"Product Option","Name","Code",null,"Philippines",0.1,null,null,null,"November","Cycle 1"]
["Croatia","Multisector only","HRV",null,null,null,null,"Sustaining Partner","Option 1",1,null,"Rwanda",0.15,null,null,null,"December","Cycle 1"]
["Cuba","Multisector only","CUB","Sustaining Partner",null,null,null,"Sustaining Contributor","Option 2",2,null,"Sierra Leone ",0.1]
["Curaçao","Multisector only","CUW","Sustaining Contributor",null,null,null,"Ad-Hoc Subscriber","Option 3",3,null,"South Africa",0.2]
["Djibouti","Multisector only","DJI","Ad-Hoc Subscriber",null,null,null,null,null,null,null,"South Sudan",0.15]
["Dominican Republic","NGOLP & Multisector","DOM",null,null,null,null,null,null,null,null,"Turkmenistan",0.1]
["Ecuador","NGOLP & Multisector","ECU",null,null,null,null,null,null,null,null,"Uganda",0.15]
["Egypt","NGOLP & Multisector","EGY",null,null,null,null,null,null,null,null,"Tanzania",0.15]
["El Salvador","NGOLP & Multisector","SLV"]
["Equatorial Guinea","Multisector only","GNQ"]
["Eritrea","Multisector only","ERI"]
["Estonia","Multisector only","EST","Indigo™"]
["Eswatini","NGOLP & Multisector","SWZ","Reports Only"]
["Ethiopia","NGOLP & Multisector","ETH"]
["Fiji","Multisector only","FJI",null,null,null,null,"Controls for SO Extract"]
["Gabon","Multisector only","GAB"]
["Gambia","Multisector only","GMB",null,null,null,null,"Select"]
["Georgia","NGOLP & Multisector","GEO",null,null,null,null,"MS"]
["Ghana","NGOLP & Multisector","GHA",null,null,null,null,"NGO"]
["Greece","NGOLP Only","GRC",null,null,null,null,"MS & NGO"]
["Grenada","Multisector only","GRD"]
["Guatemala","NGOLP & Multisector","GTM",null,null,null,null,"Select"]
["Guinea","NGOLP & Multisector","GIN",null,null,null,null,"New"]
["Guinea-Bissau","Multisector only","GNB",null,null,null,null,"Update"]
["Guyana","Multisector only","GUY",null,null,null,null,"Update (treat as NEW)"]
["Haiti","NGOLP & Multisector","HTI"]
["Honduras","NGOLP & Multisector","HND",null,null,null,null,"Select"]
["Hong Kong","NGOLP Only","HKG",null,null,null,null,"English"]
["India","NGOLP & Multisector","IND",null,null,null,null,"French"]
["Indonesia","NGOLP & Multisector","IDN",null,null,null,null,"Spanish"]
["Iran","Multisector only","IRN",null,null,null,null,"Multi-language"]
["Iraq (Baghdad)","NGOLP & Multisector","IRQ (Baghdad)"]
["Iraq (Erbil)","NGOLP Only","IRQ (Erbil)",null,null,null,null,"Select"]
["Israel","Multisector only","ISR",null,null,null,null,"Data Collection and Entry"]
["Jamaica","Multisector only","JAM",null,null,null,null,"Data Entry Only"]
["Jordan","NGOLP & Multisector","JOR"]
["Kazakhstan","Multisector only","KAZ",null,null,null,null,"Select"]
["Kenya","NGOLP & Multisector","KEN",null,null,null,null,"Paying"]
["Kiribati","Multisector only","KIR",null,null,null,null,"Non-Paying"]
["Kosovo","NGOLP & Multisector","XKX"]
["Kuwait","Multisector only","KWT"]
["Kyrgyzstan","NGOLP & Multisector","KGZ"]
["Laos","NGOLP & Multisector","LAO"]
["Latvia","Multisector only","LVA"]
["Lebanon","NGOLP & Multisector","LBN"]
["Lesotho","NGOLP & Multisector","LSO"]
["Liberia","NGOLP & Multisector","LBR"]
["Libya","Multisector only","LBY"]
["Lithuania","Multisector only","LTU"]
["Madagascar","NGOLP & Multisector","MDG"]
["Malawi","NGOLP & Multisector","MWI"]
["Malaysia","NGOLP & Multisector","MYS"]
["Maldives","Multisector only","MDV"]
["Mali","NGOLP & Multisector","MLI"]
["Malta","Multisector only","MLT"]
["Marshall Islands","Multisector only","MHL"]
["Mauritania","Multisector only","MRT"]
["Mauritius","Multisector only","MUS"]
["Mexico","NGOLP & Multisector","MEX"]
["Micronesia, Federated States of","Multisector only","FSM"]
["Moldova","Multisector only","MDA"]
["Mongolia","Multisector only","MNG"]
["Montenegro","Multisector only","MNE"]
["Morocco","Multisector only","MAR"]
["Mozambique","NGOLP & Multisector","MOZ"]
["Myanmar","NGOLP & Multisector","MMR"]
["Namibia","NGOLP & Multisector","NAM"]
["Nepal","NGOLP & Multisector","NPL"]
["Netherlands","NGOLP Only","NLD"]
["Nicaragua","NGOLP & Multisector","NIC"]
["Niger","NGOLP & Multisector","NER"]
["Nigeria","NGOLP & Multisector","NGA"]
["North Macedonia","Multisector only","MKD"]
["Oman","Multisector only","OMN"]
["OPT (East Jerusalem)","NGOLP Only","PSE (East Jerusalem)"]
["OPT (Gaza City)","NGOLP Only","PSE (Gaza City)"]
["OPT (Ramallah)","NGOLP Only","PSE (Ramallah)"]
["Pakistan","NGOLP & Multisector","PAK"]
["Palau","Multisector only","PLW"]
["Panama","NGOLP & Multisector","PAN"]
["Papua New Guinea","NGOLP & Multisector","PNG"]
["Paraguay","Multisector only","PRY"]
["Peru","NGOLP & Multisector","PER"]
["Philippines","NGOLP & Multisector","PHL"]
["Poland","Multisector only","POL"]
["Qatar","Multisector only","QAT"]
["Romania","Multisector only","ROU"]
["Russia","Multisector only","RUS"]
["Rwanda","NGOLP & Multisector","RWA"]
["Samoa","Multisector only","WSM"]
["Sao Tome & Principe","Multisector only","STP"]
["Saudi Arabia","Multisector only","SAU"]
["Senegal","NGOLP & Multisector","SEN"]
["Serbia","NGOLP & Multisector","SRB"]
["Seychelles","Multisector only","SYC"]
["Sierra Leone","NGOLP & Multisector","SLE"]
["Singapore","Multisector only","SGP"]
["Sint Maarten","Multisector only","SXM"]
["Slovakia","Multisector only","SVK"]
["Solomon Islands","Multisector only","SLB"]
["Somalia","NGOLP & Multisector","SOM"]
["Somaliland","NGOLP Only","SML"]
["South Africa","NGOLP & Multisector","ZAF"]
["South Korea","Multisector only","KOR"]
["South Sudan","NGOLP & Multisector","SSD"]
["Spain","NGOLP Only","ESP"]
["Sri Lanka","NGOLP & Multisector","LKA"]
["Sudan","NGOLP & Multisector","SDN"]
["Suriname","Multisector only","SUR"]
["Switzerland","NGOLP Only","CHE"]
["Syria","NGOLP & Multisector","SYR"]
["Tajikistan","NGOLP & Multisector","TJK"]
["Tanzania","NGOLP & Multisector","TZA"]
["Thailand","NGOLP & Multisector","THA"]
["Timor-Leste","NGOLP & Multisector","TLS"]
["Togo","Multisector only","TGO"]
["Tonga","Multisector only","TON"]
["Trinidad and Tobago","Multisector only","TTO"]
["Tunisia","NGOLP & Multisector","TUN"]
["Turkey","NGOLP & Multisector","TUR"]
["Turkmenistan","Multisector only","TKM"]
["Uganda","NGOLP & Multisector","UGA"]
["Ukraine","NGOLP & Multisector","UKR"]
["United Arab Emirates","Multisector only","ARE"]
["United Kingdom","NGOLP & Multisector","GBR"]
["United States","NGOLP Only","USA"]
["Uruguay","Multisector only","URY"]
["Uzbekistan","Multisector only","UZB"]
["Vanuatu","Multisector only","VUT"]
["Venezuela","Multisector only","VEN"]
["Vietnam","NGOLP & Multisector","VNM"]
["Yemen","NGOLP & Multisector","YEM"]
["Zambia","NGOLP & Multisector","ZMB"]
["Zimbabwe","NGOLP & Multisector","ZWE"]